{"text_format":"1","workbook":"xlsx","n_sheets":4,"sheets":["改定履歴","Sheet1","Sheet2","iE_Setting"],"not_rendered":{"charts":0,"images":1,"macros":1,"external_links":0,"defined_names":2,"comments":0,"pivot_tables":0},"unopened":[],"bounds":{"document_bytes":16777216,"sheet_cells":100000,"rows_first":2000,"rows_last":500,"rows_between":2000,"halvings":0,"cell_chars":16384,"cell_head_chars":4096},"cells_cut":0,"cells_raw":0,"read":"whole","date_system":"1900"}

{"sheet":"改定履歴","index":0,"n_rows":9,"n_cols":10,"rows_kept":9,"cut":false,"hidden":false,"merged":[]}
[]
[null,"date","VER","内容",null,null,null,null,null,"作業者"]
[null,"2020-09-30","1.00","新規作成",null,null,null,null,null,"光永"]
[null,"2020-12-22",1.01,"ヘッダ削除その他微調整",null,null,null,null,null,"光永"]
[null,"2021-01-05","1.02","入力フォームを追加",null,null,null,null,null,"光永"]
[null,"2021-04-27","1.03","ボタン配置の変更（検索と集計）、フィルタ再設定、ウィンドウ枠の固定",null,null,null,null,null,"豊田"]
[null,"2021-08-16","1.04","検索時の対象行のアクティブ化、検索入力フォームの改良",null,null,null,null,null,"豊田"]
[null,"2021-08-20","1.05","検索ｰ数量入力時、ブランク入力を不可とした。最下部連続入力の改修",null,null,null,null,null,"豊田"]
[null,"2022-04-21","1.06","show modal =True →Falseへ変更",null,null,null,null,null,"光永"]

{"sheet":"Sheet1","index":1,"n_rows":1541,"n_cols":14,"rows_kept":1541,"cut":false,"hidden":false,"merged":[]}
[]
[null,"棚卸一覧_1",null,null,null,{"$f":"IF(E2=\"\",\"LIKE '%'\",\"between \"&TEXT(E2,\"'0000!/00!/00'\")&\" and \"&TEXT(E2+1,\"'0000!/00!/00'\"))","v":"LIKE '%'"}]
[]
[null,null,"部門","00400",{"$f":"IF(D4=\"ALL\",\" like '%'\",\" = '\"&D4&\"'\")","v":" = '00400'"},null,null,null,null,null,null,null,null,{"$f":"IF(M4=\"\",\"LIKE '%'\",\"LIKE '%\"&M4&\"%'\")","v":"LIKE '%'"}]
[null,null,"商品",null,{"$f":"_xlfn.SWITCH(D8,1,IF(D5=\"\",\"LIKE '%'\",\"like '%\"&D5&\"%'\"),2,IF(D5=\"\",\"LIKE '%'\",\"NOT LIKE '%\"&D5&\"%'\"),3,IF(D5=\"\",\"LIKE '%'\",\"LIKE '%\"&D5&\"%'\"))","v":"LIKE '%'"},null,null,null,null,null,null,null,null,{"$f":"IF(M5=\"\",\"LIKE '%'\",\"LIKE '%\"&M5&\"%'\")","v":"LIKE '%'"}]
[null,null,"材質",null,{"$f":"IF(D6=\"\",\"LIKE '%'\",\"LIKE '%\"&D6&\"%'\")","v":"LIKE '%'"},null,null,null,null,null,null,null,null,{"$f":"IF(M6=\"\",\"LIKE '%'\",\"LIKE '%\"&M6&\"%'\")","v":"LIKE '%'"}]
[null,null,"色調",null,{"$f":"IF(D7=\"\",\"LIKE '%'\",\"LIKE '%\"&D7&\"%'\")","v":"LIKE '%'"},null,"ロケーション：","N",null,null,null,null,null,{"$f":"IF(M7=\"\",\"LIKE '%'\",\"LIKE '%\"&M7&\"%'\")","v":"LIKE '%'"}]
[null,null,"切替",1,"1：コイル　2：コイル以外 3:商品指定",null,null,null,null,null,null,null,null,{"$f":"IF(M8=\"\",\"LIKE '%'\",\"LIKE '%\"&M8&\"%'\")","v":"LIKE '%'"}]
[null,null,null,null,null,null,null,"シール済",{"$f":"MAX(G:G)","v":0}]
[1,"ロット","材質","色調名",null,null,"SEQ","数量","備考","板厚","幅","在庫数","実棚数","差異"]
[1,"D23525013","MF","MK010 亜鉛メッキ処理",null,null,null,null,null,"1.00","100",783]
[2,"D23525014","MF","MK010 亜鉛メッキ処理",null,null,null,null,null,"1.00","100",783]
[3,"D23525015","MF","MK010 亜鉛メッキ処理",null,null,null,null,null,"1.00","100",783]
[4,"D23525016","MF","MK010 亜鉛メッキ処理",null,null,null,null,null,"1.00","100",783]
[5,"D23525017","MF","MK010 亜鉛メッキ処理",null,null,null,null,null,"1.00","100",783]
[6,"D23525018","MF","MK010 亜鉛メッキ処理",null,null,null,null,null,"1.00","100",783]
[7,"D23525019","MF","MK010 亜鉛メッキ処理",null,null,null,null,null,"1.00","100",783]
[8,"D23525020","MF","MK010 亜鉛メッキ処理",null,null,null,null,null,"1.00","100",783]
[9,"D23525021","MF","MK010 亜鉛メッキ処理",null,null,null,null,null,"1.00","100",783]
[10,"D23525022","MF","MK010 亜鉛メッキ処理",null,null,null,null,null,"1.00","100",783]
[11,"D23525023","MF","MK010 亜鉛メッキ処理",null,null,null,null,null,"1.00","100",783]
[12,"D23525024","MF","MK010 亜鉛メッキ処理",null,null,null,null,null,"1.00","100",783]
[57,"A22X26050","CA","BWE40 カラーアルミ　０４７３ローズブラウン",null,null,null,null,null,"0.50","1000",170]
[98,"A19Z27001","CA","GRE20 ネオマットグリーン２号",null,null,null,null,null,"0.50","1000",566]
[100,"F20X13026","CA","GRH20 ＧＲＯ－４（モスグリーン）ＣＡ",null,null,null,null,null,"0.70","1000",1345]
[138,"D22512069","CA","SL090 ＦＷ－１００５シルバー（Ｍ）",null,null,null,null,null,"0.70","1000",535]
[184,"F23328013","CA","SLSLU GTNシルバー(GBシルバーUACJ)",null,null,null,null,null,"0.70","1000",1076]
[190,"D22Y04051","CA","TWD30 GTNブラック/GTNギングロ（GBCB/GBD",null,null,null,null,null,"1.00","1000",1531]
[191,"D22Y04053","CA","TWD40 ﾗｲﾄｼﾙﾊﾞｰALPS/ﾎﾞｰ ﾄﾙｰﾌﾎﾜｲ",null,null,null,null,null,"1.00","1000",800]
[199,"D23509002","CA","WTR60 GBライトグレー",null,null,null,null,null,"1.00","1000",1502]
[200,"D23509003","CA","WTR60 GBライトグレー",null,null,null,null,null,"1.00","1000",1488]
[201,"D23509004","CA","WTR60 GBライトグレー",null,null,null,null,null,"1.00","1000",962]
[202,"D23509005","CA","WTR60 GBライトグレー",null,null,null,null,null,"1.00","1000",1448]
[203,"D23509006","CA","WTR60 GBライトグレー",null,null,null,null,null,"1.00","1000",1446]
[204,"D23509007","CA","WTR60 GBライトグレー",null,null,null,null,null,"1.00","1000",1360]
[205,"D23509008","CA","WTR60 GBライトグレー",null,null,null,null,null,"1.00","1000",1476]
[206,"D23509009","CA","WTR60 GBライトグレー",null,null,null,null,null,"1.00","1000",1478]
[207,"D23509010","CA","WTR60 GBライトグレー",null,null,null,null,null,"1.00","1000",1470]
[13,"D22727035","CG","BKBKN GTNブラック",null,null,null,null,null,"0.40","1000",853]
[14,"D23123016","CG","BKBKN GTNブラック",null,null,null,null,null,"0.40","1000",2114]
[15,"D23227003","CG","BKBKN GTNブラック",null,null,null,null,null,"0.40","1000",2371]
[16,"D23529013","CG","BKBKN GTNブラック",null,null,null,null,null,"0.40","1000",2518]
[17,"D23130014","CG","BKBKN GTNブラック",null,null,null,null,null,"0.50","1000",1798]
[21,"F18723008","CG","BKS00 チヨダストロングカラーＮＥＸＴ　ＧＥ０１",null,null,null,null,null,"0.50","1000",274]
[26,"A21302023","CG","BKX10 ストロングカラーＶ３　ＧＪＥ０１／９０２",null,null,null,null,null,"0.35","1000",978]
[27,"D22412001","CG","BKX10 ストロングカラーＶ３　ＧＪＥ０１／９０２",null,null,null,null,null,"0.45","1000",200]
[28,"D23113045","CG","BKX10 ストロングカラーＶ３　ＧＪＥ０１／９０２",null,null,null,null,null,"0.40","1000",2185]
[29,"D23510001","CG","BKX10 ストロングカラーＶ３　ＧＪＥ０１／９０２",null,null,null,null,null,"0.50","1000",1791]
[30,"D22829035","CG","BKY30 ヨドＨｙｐｅｒＧＬカラー萠　ＫＳ９９Ｈ黒",null,null,null,null,null,"0.40","1000",1638]
[31,"A21526002","CG","BKY30 ヨドＨｙｐｅｒＧＬカラー萠　ＫＳ９９Ｈ黒",null,null,null,null,null,"0.50","1000",198]
[32,"D23525025","CG","BKY30 ヨドＨｙｐｅｒＧＬカラー萠　ＫＳ９９Ｈ黒",null,null,null,null,null,"0.50","1000",1603]
[33,"D22506001","CG","BKZ00 ニスクカラーPro　GHK02ブラックパール",null,null,null,null,null,"0.40","1000",212]
[40,"D22Z23020","CG","BLXS0 ストロングカラーＶ３　ＧＪＥ０７／９０２",null,null,null,null,null,"0.50","1000",75]
[41,"F22425016","CG","BLXS0 ストロングカラーＶ３　ＧＪＥ０７／９０２",null,null,null,null,null,"0.50","1000",790]
[42,"D22Z09026","CG","BLXS0 ストロングカラーＶ３　ＧＪＥ０７／９０２",null,null,null,null,null,"0.60","1000",240]
[44,"D20728019","CG","BLXZ0 ＳＥＲＩＯＳ　ＰＲＩＭＥＡ４５１　ネイビブルー",null,null,null,null,null,"0.50","1000",735]
[50,"D17616403","CG","BW3Y0 ニスクカラーつやけしＲＮ０２２",null,null,null,null,null,"0.50","1000",1250]
[51,"D22804018","CG","BW7Y0 ニスクカラーPro GC GCN34（アースブラ",null,null,null,null,null,"0.50","1000",691]
[52,"D22824043","CG","BW7Z0 ニスクカラーPro GH ブラウンGHN22",null,null,null,null,null,"0.50","1000",265]
[53,"D23512010","CG","BW8C0 ストロングカラーV3 GJE22 ニューブラウン",null,null,null,null,null,"0.40","1000",1303]
[54,"D22818039","CG","BW8J0 ストロングカラーＶ３　ＧＪＥ０４／９０２",null,null,null,null,null,"0.40","1000",949]
[55,"D23418001","CG","BW8J0 ストロングカラーＶ３　ＧＪＥ０４／９０２",null,null,null,null,null,"0.40","1000",1336]
[56,"F22801004","CG","BW8J0 ストロングカラーＶ３　ＧＪＥ０４／９０２",null,null,null,null,null,"0.40","1000",665]
[64,"D23414007","CG","BWJ70 極みＭＡＸ　Ｋ０３１　ダークブラウンＫＮＣ",null,null,null,null,null,"0.40","1000",1310]
[65,"D22Y24080","CG","BWKCN GTNコゲチャ",null,null,null,null,null,"0.40","1000",2639]
[66,"D22Z12004","CG","BWKCN GTNコゲチャ",null,null,null,null,null,"0.40","1000",173]
[67,"D22Z12020","CG","BWKCN GTNコゲチャ",null,null,null,null,null,"0.40","1000",963]
[68,"F22Z15021","CG","BWKCN GTNコゲチャ",null,null,null,null,null,"0.40","1000",364]
[69,"D22609007","CG","BWKCN GTNコゲチャ",null,null,null,null,null,"0.50","1000",164]
[70,"D23524025","CG","BWKCN GTNコゲチャ",null,null,null,null,null,"0.50","1000",2390]
[71,"D22X07025","CG","BWKCN GTNコゲチャ",null,null,null,null,null,"0.60","1000",933]
[72,"F21Z20006","CG","GD330 チヨダカラーＧＬ　輝き　ＳＨゴールド　ＧＥＲ１２",null,null,null,null,null,"0.50","1000",263]
[73,"D22819001","CG","GLD80 チヨダストロングカラーⅤ３ＧＪＥ１３／９０２",null,null,null,null,null,"0.40","1000",353]
[74,"D22819002","CG","GLD80 チヨダストロングカラーⅤ３ＧＪＥ１３／９０２",null,null,null,null,null,"0.40","1000",1108]
[75,"D23302013","CG","GLD80 チヨダストロングカラーⅤ３ＧＪＥ１３／９０２",null,null,null,null,null,"0.40","1000",1336]
[76,"A22624005","CG","GLD80 チヨダストロングカラーⅤ３ＧＪＥ１３／９０２",null,null,null,null,null,"0.45","1000",504]
[77,"D22Y25001","CG","GLD80 チヨダストロングカラーⅤ３ＧＪＥ１３／９０２",null,null,null,null,null,"0.50","1000",757]
[84,"D22311022","CG","GLU90 サンライトＧＬＲＭ８０（Ｍ）　ＯＲＭ８０／ＯＧＲ",null,null,null,null,null,"0.50","1000",542]
[85,"D22324014","CG","GLU90 サンライトＧＬＲＭ８０（Ｍ）　ＯＲＭ８０／ＯＧＲ",null,null,null,null,null,"0.50","1000",1405]
[86,"D22324001","CG","GLU90 サンライトＧＬＲＭ８０（Ｍ）　ＯＲＭ８０／ＯＧＲ",null,null,null,null,null,"0.60","1000",1977]
[87,"D22324002","CG","GLU90 サンライトＧＬＲＭ８０（Ｍ）　ＯＲＭ８０／ＯＧＲ",null,null,null,null,null,"0.60","1000",2101]
[88,"D22413011","CG","GLU90 サンライトＧＬＲＭ８０（Ｍ）　ＯＲＭ８０／ＯＧＲ",null,null,null,null,null,"0.60","1000",721]
[89,"D23118016","CG","GLVC0 ストロングカラーＶ３　ＧＪＥ３１／９０２",null,null,null,null,null,"0.50","1000",645]
[90,"D22928012","CG","GLVC0 ストロングカラーＶ３　ＧＪＥ３１／９０２",null,null,null,null,null,"0.40","1000",310]
[91,"D22Z23004","CG","GLVC0 ストロングカラーＶ３　ＧＪＥ３１／９０２",null,null,null,null,null,"0.40","1000",1503]
[92,"D23313016","CG","GLVC0 ストロングカラーＶ３　ＧＪＥ３１／９０２",null,null,null,null,null,"0.40","1000",731]
[93,"D23123049","CG","GLVJ0 ニスクカラーPRO GCA51 Sマットグレー",null,null,null,null,null,"0.50","1000",185]
[94,"D23123050","CG","GLVJ0 ニスクカラーPRO GCA51 Sマットグレー",null,null,null,null,null,"0.50","1000",2406]
[96,"D21Y05009","CG","GR5D0 サンライトＧＬＲＧ８５　ＯＲＧ８５／ＯＲＧ",null,null,null,null,null,"0.50","1000",1314]
[97,"F21209001","CG","GR9P0 サンライトＧＬＧＲＯ－２／　（ＲＧ１４０５）",null,null,null,null,null,"0.60","1000",1268]
[103,"D22530007","CG","GRMGN GTNモスグリーン",null,null,null,null,null,"0.40","1000",677]
[104,"D22Y01021","CG","GRMGN GTNモスグリーン",null,null,null,null,null,"0.40","1000",2014]
[105,"D23227001","CG","GRRYN GTNロクショウ",null,null,null,null,null,"0.40","1000",1157]
[110,"D23227052","CG","GRTZ0 チヨダストロングカラーＶ３　ＧＪＥ１１",null,null,null,null,null,"0.40","1000",330]
[111,"D21518024","CG","GRTZ0 チヨダストロングカラーＶ３　ＧＪＥ１１",null,null,null,null,null,"0.50","1000",1020]
[112,"D22Y11016","CG","GRTZ0 チヨダストロングカラーＶ３　ＧＪＥ１１",null,null,null,null,null,"0.50","1000",682]
[116,"D22706011","CG","GRX50 ニスクカラーPro GCG06Ｓウグイス",null,null,null,null,null,"0.50","1000",1195]
[117,"D23411013","CG","GRX60 耐摩カラーSGL  517S",null,null,null,null,null,"0.50","1000",1706]
[118,"D21119022","CG","GRZ50 サンライトＧＬＲＧ８１ＥＲＧ８１／ＯＲＧ（ＦＧ２",null,null,null,null,null,"0.60","1000",2058]
[119,"D22X07041","CG","OR490 ニスクカラーpro GHY35Sオレンジ",null,null,null,null,null,"0.40","1000",1080]
[120,"D22524013","CG","OR490 ニスクカラーpro GHY35Sオレンジ",null,null,null,null,null,"0.50","1000",552]
[121,"A23130006","CG","RDC60 ストロングカラーＶ３　ＧＪＥ１２／９０２",null,null,null,null,null,"0.40","1000",925]
[122,"F22Y24021","CG","RDC60 ストロングカラーＶ３　ＧＪＥ１２／９０２",null,null,null,null,null,"0.40","1000",80]
[123,"D22914013","CG","RDC60 ストロングカラーＶ３　ＧＪＥ１２／９０２",null,null,null,null,null,"0.50","1000",147]
[124,"D20115002","CG","RDC60 ストロングカラーＶ３　ＧＪＥ１２／９０２",null,null,null,null,null,"0.60","1000",601]
[125,"D21Z21026","CG","RDE40 チヨダカラーＧＬ　輝き　ＳＨレンガ　ＧＥＲ９０",null,null,null,null,null,"0.50","1000",173]
[126,"D22X07038","CG","RDQ00 ニスクカラーPro つやありGCR24　Sレッド",null,null,null,null,null,"0.50","1000",1143]
[127,"D22Z23001","CG","RDRBC GTNレッドブラウン(千代田GJE49)",null,null,null,null,null,"0.50","1000",397]
[128,"D22Y25016","CG","RDRBN GTNレッドブラウン",null,null,null,null,null,"0.40","1000",1384]
[129,"D23509001","CG","RDRBN GTNレッドブラウン",null,null,null,null,null,"0.40","1000",1767]
[141,"D23130040","CG","SL4G0 チヨダストロングカラーＶ３　ＧＪＥ０８／９０２",null,null,null,null,null,"0.40","1000",1204]
[142,"A22822003","CG","SL4G0 チヨダストロングカラーＶ３　ＧＪＥ０８／９０２",null,null,null,null,null,"0.45","1000",366]
[143,"D22603032","CG","SL4G0 チヨダストロングカラーＶ３　ＧＪＥ０８／９０２",null,null,null,null,null,"0.60","1000",163]
[144,"D22823012","CG","SL4G0 チヨダストロングカラーＶ３　ＧＪＥ０８／９０２",null,null,null,null,null,"0.50","1000",1050]
[146,"D20X27021","CG","SL4T0 ニスクカラーＳＧＬ　ＲＭ０１６Ｓ　ギングロ",null,null,null,null,null,"0.50","1000",524]
[151,"D22Y04016","CG","SL5T0 極みＭＡＸ　Ｋ０４５　ＫＮＣシルバーブラック（Ｍ",null,null,null,null,null,"0.50","1000",1114]
[152,"D21517013","CG","SL5T0 極みＭＡＸ　Ｋ０４５　ＫＮＣシルバーブラック（Ｍ",null,null,null,null,null,"0.60","1000",1550]
[153,"D22Y11026","CG","SL6A0 チヨダカラーＧＬ　輝き　ＳＨシルバー　ＧＥＲ８１",null,null,null,null,null,"0.40","1000",887]
[154,"D22322022","CG","SL6A0 チヨダカラーＧＬ　輝き　ＳＨシルバー　ＧＥＲ８１",null,null,null,null,null,"0.50","1000",815]
[155,"D22928025","CG","SL6A0 チヨダカラーＧＬ　輝き　ＳＨシルバー　ＧＥＲ８１",null,null,null,null,null,"0.50","1000",2184]
[156,"D23411009","CG","SL6D0 耐摩カラーSGL　５７０S耐摩いぶし銀（Ｍ）",null,null,null,null,null,"0.50","1000",770]
[157,"D23411010","CG","SL6D0 耐摩カラーSGL　５７０S耐摩いぶし銀（Ｍ）",null,null,null,null,null,"0.50","1000",2373]
[158,"D19204400","CG","SL6F0 ニスクカラーＳＧＬ　ＲＭ０２６Ｓシルバーブラウン",null,null,null,null,null,"0.40","1000",158]
[161,"D23411032","CG","SL7B0 チヨダストロングＶ３　ＧＱＶ８０／９０２　（Ｍ）",null,null,null,null,null,"0.40","1000",140]
[162,"D22Y24003","CG","SL7B0 チヨダストロングＶ３　ＧＱＶ８０／９０２　（Ｍ）",null,null,null,null,null,"0.50","1000",245]
[163,"A22523003","CG","SL7M0 ニスクカラーＰＲＯ　ＧＣＭ１６　いぶし銀",null,null,null,null,null,"0.40","1000",415]
[164,"D23123027","CG","SL7M0 ニスクカラーＰＲＯ　ＧＣＭ１６　いぶし銀",null,null,null,null,null,"0.40","1000",321]
[165,"D22Y28012","CG","SL7M0 ニスクカラーＰＲＯ　ＧＣＭ１６　いぶし銀",null,null,null,null,null,"0.50","1000",321]
[166,"D22622035","CG","SL7Q0 ニスクカラーPro GCM26Ｃシルバーブラウン",null,null,null,null,null,"0.40","1000",268]
[167,"D22X11001","CG","SL7R0 ヨドhyper GLカラー萠KS95H 銀黒",null,null,null,null,null,"0.50","1000",417]
[168,"D23525011","CG","SL7S0 ニスクカラーpro GCM36ペールゴールド",null,null,null,null,null,"0.50","1000",1821]
[170,"D23221025","CG","SL8F0 GTNギングロ（JFE）",null,null,null,null,null,"0.50","1000",1268]
[171,"D22725022","CG","SLGGN GTNギングロ",null,null,null,null,null,"0.40","1000",106]
[172,"D22X14023","CG","SLGGN GTNギングロ",null,null,null,null,null,"0.40","1000",999]
[173,"D23110003","CG","SLGGN GTNギングロ",null,null,null,null,null,"0.40","1000",2168]
[174,"D23317020","CG","SLGGN GTNギングロ",null,null,null,null,null,"0.40","1000",1496]
[175,"D23130013","CG","SLGGN GTNギングロ",null,null,null,null,null,"0.50","1000",1592]
[176,"D23526004","CG","SLGGN GTNギングロ",null,null,null,null,null,"0.50","1000",2427]
[177,"D22926018","CG","SLGGN GTNギングロ",null,null,null,null,null,"0.60","1000",1823]
[178,"D23306007","CG","SLSLC GTNシルバー(千代田GJE77)",null,null,null,null,null,"0.50","1000",1675]
[179,"D22926001","CG","SLSLN GTNシルバー",null,null,null,null,null,"0.40","1000",1930]
[180,"D23210003","CG","SLSLN GTNシルバー",null,null,null,null,null,"0.40","1000",575]
[181,"D23328005","CG","SLSLN GTNシルバー",null,null,null,null,null,"0.40","1000",352]
[182,"D23328018","CG","SLSLN GTNシルバー",null,null,null,null,null,"0.40","1000",327]
[183,"D23328019","CG","SLSLN GTNシルバー",null,null,null,null,null,"0.40","1000",2108]
[185,"A21Y11048","CG","TC010 ＴＥ００７　テラコット元旦マーブルーフ",null,null,null,null,null,"0.40","1000",485]
[186,"A22317002","CG","TW6E0 チヨダカラー輝き　ＧＥＲ１０／ＧＥＲ１２",null,null,null,null,null,"0.50","1000",620]
[187,"A21405001","CG","TW6G0 チヨダカラー輝き　ＧＥＲ８０／ＧＥＲ９０",null,null,null,null,null,"0.60","1000",1544]
[189,"A20720002","CG","TWA80 ニスクカラーＳＧＬ　ＲＭ０１６Ｓ／ＲＭ０１６Ｓ",null,null,null,null,null,"0.50","1000",2025]
[194,"D22621001","CG","WTM40 極みＭＡＸ　Ｋ００５　ＡマットホワイトＫＮＣ",null,null,null,null,null,"0.40","1000",130]
[195,"D22Z01022","CG","WTP00 ストロングカラーＶ３　ＧＪＥ３２／９０２ ホワイ",null,null,null,null,null,"0.40","1000",218]
[196,"D22Z16069","CG","WTP60 ニスクカラーＰＲＯ　つやありＧＣＷ０７",null,null,null,null,null,"0.40","1000",1763]
[197,"D22926017","CG","WTP60 ニスクカラーＰＲＯ　つやありＧＣＷ０７",null,null,null,null,null,"0.60","1000",579]
[198,"F21624033","CG","WTP90 ストロングカラーＶ３　ＧＪＥ２３／９０２ アイ",null,null,null,null,null,"0.27","1000",546]
[19,"D22Y18052","CS","BKG30 ＢＫＯ－５（黒）ＣＳ",null,null,null,null,null,"0.40","1000",678]
[39,"D16208001","CS","BLH30 ＢＬＯ－８（ブルー）ＣＳ",null,null,null,null,null,"0.45","1000",126]
[59,"D22315021","CS","BWG30 ＢＷＯ－１（茶）ＣＳ",null,null,null,null,null,"0.40","1000",747]
[78,"F21Z21011","CS","GLG30 ＧＬＯ－３（グレー）ＣＳ",null,null,null,null,null,"0.45","1000",334]
[101,"D22325021","CS","GRH30 ＧＲＯ－４（モスグリーン）ＣＳ",null,null,null,null,null,"0.45","1000",1326]
[113,"A22X12030","CS","GRUJ0 LN51（ＡＵ－００１）",null,null,null,null,null,"0.45","1000",1278]
[34,"D21820023","FA","BLG60 ＢＬＯ－６（濃紺）ＦＡ",null,null,null,null,null,"0.70","1000",209]
[79,"D21427001","FA","GLG60 ＧＬＯ－３（グレー）ＦＡ",null,null,null,null,null,"0.70","1000",277]
[102,"D15123409","FA","GRH60 ＧＲＯ－４（モスグリーン）ＦＡ",null,null,null,null,null,"0.70","1000",81]
[131,"D21Z20002","FA","RNG60 ＲＮＯ－７　（レンガ）ＦＡ",null,null,null,null,null,"0.70","1000",575]
[18,"A19Y05006","FG","BKE60 サンフロンＧＬセラＴＺＬ－９９",null,null,null,null,null,"0.45","1000",163]
[20,"D21Z22004","FG","BKGL0 ＢＫＯ－５（黒）　ＦＫ２０１８／ＲＡ１４２３",null,null,null,null,null,"0.45","1000",292]
[22,"D21426031","FG","BKSL0 ニスクフロンＳＧＬ　ＢＫＯ－５　ＦＫ２０５５",null,null,null,null,null,"0.45","1000",578]
[23,"A21528026","FG","BKT30 チヨダカラーＨＦ２０　ＧＨ１／９０２",null,null,null,null,null,"0.45","1000",231]
[24,"D21309022","FG","BKT30 チヨダカラーＨＦ２０　ＧＨ１／９０２",null,null,null,null,null,"0.50","1000",999]
[25,"D19212300","FG","BKV60 ＪＦＥカラーＦ２０ＧＬデープブラックＦ４１３Ｍ",null,null,null,null,null,"0.45","1000",2273]
[36,"D21616018","FG","BLGL0 ＢＬＯ－６（濃紺）ＦＢ１４７１／ＲＡ１４２３",null,null,null,null,null,"0.45","1000",337]
[37,"D21915002","FG","BLGL0 ＢＬＯ－６（濃紺）ＦＢ１４７１／ＲＡ１４２３",null,null,null,null,null,"0.45","1000",1457]
[38,"D23317012","FG","BLGL0 ＢＬＯ－６（濃紺）ＦＢ１４７１／ＲＡ１４２３",null,null,null,null,null,"0.45","1000",910]
[43,"D20717008","FG","BLXV0 チヨダカラーＨＦ２０　ＧＨ５０７　ブルー",null,null,null,null,null,"0.50","1000",389]
[45,"D20X07025","FG","BLYB0 ヨドHyperGLカラータフロンＹＴ５５Ｈブルー",null,null,null,null,null,"0.50","1000",967]
[46,"D20727400","FG","BR400 サンフロンＧＬＴＦＭ－０６／ＦＭ１４６９　Ｍ）",null,null,null,null,null,"0.50","1000",274]
[47,"D20Z10028","FG","BW3P0 チヨダカラーＨＦ２０　ＧＨ１３２",null,null,null,null,null,"0.45","1000",291]
[48,"D21628001","FG","BW3P0 チヨダカラーＨＦ２０　ＧＨ１３２",null,null,null,null,null,"0.50","1000",663]
[49,"A19828005","FG","BW3W0 ＢＷＯ－１　（淀）ＹＦ９０１",null,null,null,null,null,"0.45","1000",1431]
[58,"D18Y27012","FG","BWF30 ニスクフロンＳＧＬ　ＦＮ１０２Ｓブラウン",null,null,null,null,null,"0.45","1000",467]
[60,"A21405024","FG","BWGL0 ＢＷＯ－１（茶）ＦＮ２０２５／ＲＡ１４２３",null,null,null,null,null,"0.40","1000",399]
[61,"D21Y05012","FG","BWGL0 ＢＷＯ－１（茶）ＦＮ２０２５／ＲＡ１４２３",null,null,null,null,null,"0.40","1000",495]
[62,"F21910002","FG","BWGL0 ＢＷＯ－１（茶）ＦＮ２０２５／ＲＡ１４２３",null,null,null,null,null,"0.60","1000",416]
[63,"A21Z24002","FG","BWGL0 ＢＷＯ－１（茶）ＦＮ２０２５／ＲＡ１４２３",null,null,null,null,null,"0.45","1000",975]
[80,"D22413015","FG","GLGL0 ＧＬＯ－３（グレー）ＦＡ１４５７／ＲＡ１４２３",null,null,null,null,null,"0.45","1000",1226]
[81,"F20Z23014","FG","GLGL0 ＧＬＯ－３（グレー）ＦＡ１４５７／ＲＡ１４２３",null,null,null,null,null,"0.50","1000",241]
[82,"D20Y13015","FG","GLJ10 チヨダカラーＨＦ２０　ＧＨ７４１",null,null,null,null,null,"0.50","1000",202]
[83,"F20925026","FG","GLJ10 チヨダカラーＨＦ２０　ＧＨ７４１",null,null,null,null,null,"0.50","1000",263]
[95,"D21625010","FG","GLZS0 ニスクフロンＳＧＬ　ＦＡ１０６Ｓ　グレー",null,null,null,null,null,"0.50","1000",111]
[99,"D21X28031","FG","GRGL0 ＧＲＯ－２（緑青）ＦＧ１３２１／ＲＡ１４２３",null,null,null,null,null,"0.45","1000",494]
[106,"D20X06014","FG","GRSE0 チヨダカラーＨＦ２０　ＧＨ２",null,null,null,null,null,"0.45","1000",556]
[107,"D20917001","FG","GRSE0 チヨダカラーＨＦ２０　ＧＨ２",null,null,null,null,null,"0.50","1000",1092]
[108,"D22830013","FG","GRSE0 チヨダカラーＨＦ２０　ＧＨ２",null,null,null,null,null,"0.50","1000",964]
[109,"D20818021","FG","GRSV0 チヨダカラーＨＦ２０　ＧＨ３４２",null,null,null,null,null,"0.45","1000",270]
[114,"D21Z15087","FG","GRVC0 ニスクフロンＳＧＬ　ＦＧ１０４Ｓロクショウ",null,null,null,null,null,"0.50","1000",927]
[115,"D20714023","FG","GRVC0 ニスクフロンＳＧＬ　ＦＧ１０４Ｓロクショウ",null,null,null,null,null,"0.40","1000",113]
[130,"A18Y13301","FG","RN810 チヨダカラーＨＦ２０　ＧＨ１５１",null,null,null,null,null,"0.50","1000",278]
[132,"D21X07016","FG","RNGL0 ＲＮＯ－７（レンガ）ＦＲ１４２６／ＲＡ１４２３",null,null,null,null,null,"0.50","1000",358]
[133,"D18209400","FG","RNSL0 ニスクフロンＳＧＬ　ＲＮＯ－７",null,null,null,null,null,"0.45","1000",430]
[139,"D19521018","FG","SL3G0 チヨダカラーＨＦ２０　ＧＨ８０　（Ｍ）　ＧＨ８０",null,null,null,null,null,"0.35","1000",552]
[140,"D21X11011","FG","SL3G0 チヨダカラーＨＦ２０　ＧＨ８０　（Ｍ）　ＧＨ８０",null,null,null,null,null,"0.50","1000",713]
[145,"D22Z16060","FG","SL4M0 ニスクフロンＳＧＬ　ＦＭ１０８Ｓ（Ｍ）",null,null,null,null,null,"0.40","1000",258]
[150,"A21X28001","FG","SL5H0 ニスクフロンＳＧＬ　ＦＭ１０７Ｓ（Ｍ）",null,null,null,null,null,"0.45","1000",455]
[160,"F20619005","FG","SL6V0 ヨドフロンＹＦ６３１　シルバー",null,null,null,null,null,"0.45","1000",1964]
[169,"D22215072","FG","SL7Y0 ヨドフロンYH203/YT1銀黒",null,null,null,null,null,"0.50","1000",1105]
[188,"A21803003","FG","TWA20 ＲＮＯ－７／ＢＷＯ－１",null,null,null,null,null,"0.50","1000",654]
[35,"A21911001","FS","BLG90 ＢＬＯ－６（濃紺）　F904 ＦＳ",null,null,null,null,null,"0.45","1000",128]
[134,"D22207012","NG","SG900 ガルバリウム素地（日鉄鋼板）ＡＺ１５０",null,null,null,null,null,"0.50","1000",2446]
[135,"D22207014","NG","SG900 ガルバリウム素地（日鉄鋼板）ＡＺ１５０",null,null,null,null,null,"0.50","1000",2491]
[136,"D19725038","NG","SG900 ガルバリウム素地（日鉄鋼板）ＡＺ１５０",null,null,null,null,null,"0.40","1000",345]
[137,"D22Z15007","NG","SGB60 ガルバリウム素地（淀）",null,null,null,null,null,"0.50","1000",801]
[147,"D22Y18025","UF","SL4U0 ハイレタンＵＺ５３１ギングロ（ＳＧＬ）（Ｍ）",null,null,null,null,null,"0.40","1000",965]
[148,"D22624012","UF","SL4U0 ハイレタンＵＺ５３１ギングロ（ＳＧＬ）（Ｍ）",null,null,null,null,null,"0.50","1000",522]
[149,"F18Y22401","UF","SL4V0 ハイレタンＵＺ５３０シルバー",null,null,null,null,null,"0.50","1000",154]
[159,"F23425005","UF","SL6M0 ハイレタンＳＧＬ　ＵＺ５３０Ｓ　シルバー（Ｍ）",null,null,null,null,null,"0.50","1000",565]
[192,"D18213400","UF","WTL30 ハイレタンＳＧＬ　ＵＺ１３１　サンドホワイト",null,null,null,null,null,"0.40","1000",683]
[193,"D22524009","UF","WTL30 ハイレタンＳＧＬ　ＵＺ１３１　サンドホワイト",null,null,null,null,null,"0.40","1000",939]
[208,"D22311028","FG","GLGL0 ＧＬＯ－３（グレー）ＦＡ１４５７／ＲＡ１４２３",null,null,null,null,null,"0.45","101",32]
[209,"D18627002","TI","SGA10 ＡＤ０３",null,null,null,null,null,"0.40","101",35]
[210,"D22824056","CG","BKBKN GTNブラック",null,null,null,null,null,"0.40","1070",638]
[214,"A22111004","CG","BWM40 サンライトＧＬＲＲ８０　ＲＲ２０４６（ＯＲＲ８０",null,null,null,null,null,"0.40","1070",975]
[215,"A21602004","CG","GR5D0 サンライトＧＬＲＧ８５　ＯＲＧ８５／ＯＲＧ",null,null,null,null,null,"0.50","1070",245]
[216,"D20406400","CG","GR5D0 サンライトＧＬＲＧ８５　ＯＲＧ８５／ＯＲＧ",null,null,null,null,null,"0.50","1070",92]
[219,"D22X04001","CG","GRRYN GTNロクショウ",null,null,null,null,null,"0.40","1070",794]
[220,"D22X04002","CG","GRRYN GTNロクショウ",null,null,null,null,null,"0.40","1070",2327]
[221,"D22Y25017","CG","RDRBN GTNレッドブラウン",null,null,null,null,null,"0.40","1070",199]
[222,"D22Y25018","CG","RDRBN GTNレッドブラウン",null,null,null,null,null,"0.40","1070",2249]
[224,"D21202035","CG","SL2V0 ニスクカラーＲＭ０１６ギングロ（Ｍ）",null,null,null,null,null,"0.50","1070",894]
[225,"D22X17050","CG","SL7R0 ヨドhyper GLカラー萠KS95H 銀黒",null,null,null,null,null,"0.50","1070",2523]
[226,"D22X14018","CG","SLGGN GTNギングロ",null,null,null,null,null,"0.40","1070",129]
[227,"D23317015","CG","SLGGN GTNギングロ",null,null,null,null,null,"0.40","1070",845]
[228,"D22824038","CG","SLSLN GTNシルバー",null,null,null,null,null,"0.40","1070",187]
[229,"D23328020","CG","SLSLN GTNシルバー",null,null,null,null,null,"0.40","1070",2381]
[230,"D23328021","CG","SLSLN GTNシルバー",null,null,null,null,null,"0.40","1070",2081]
[231,"D23329003","CG","SLSLN GTNシルバー",null,null,null,null,null,"0.40","1070",2542]
[232,"A22Y29015","CG","SLSLN GTNシルバー",null,null,null,null,null,"0.50","1070",376]
[223,"D23306008","CS","RDRBS GTNレッドブラウン (日鉄ステンレス)LN71",null,null,null,null,null,"0.45","1070",2540]
[213,"D21113058","FA","BLG60 ＢＬＯ－６（濃紺）ＦＡ",null,null,null,null,null,"0.70","1070",1013]
[211,"A21Z24004","FG","BKGL0 ＢＫＯ－５（黒）　ＦＫ２０１８／ＲＡ１４２３",null,null,null,null,null,"0.45","1070",1796]
[212,"D21X07031","FG","BKGL0 ＢＫＯ－５（黒）　ＦＫ２０１８／ＲＡ１４２３",null,null,null,null,null,"0.45","1070",379]
[217,"F21Z22012","FG","GRGL0 ＧＲＯ－２（緑青）ＦＧ１３２１／ＲＡ１４２３",null,null,null,null,null,"0.45","1070",2187]
[218,"A21Z02003","FG","GRHL0 ＧＲＯ－４（モスグリーン）ＦＧ１３２４／ＲＡ１４",null,null,null,null,null,"0.45","1070",996]
[233,"D22Z01023","CG","BKX10 ストロングカラーＶ３　ＧＪＥ０１／９０２",null,null,null,null,null,"0.40","1080",590]
[234,"A21804004","CG","BW3V0 チヨダカラーＧＬ輝きＧＥＲ４０　シャインブラウン",null,null,null,null,null,"0.50","1080",404]
[235,"A20X05011","CG","CH420 チヨダカラーＮＥＸＴ　ＧＥ１６０（Ｍ）",null,null,null,null,null,"0.50","1080",340]
[236,"D21712020","CG","GLD80 チヨダストロングカラーⅤ３ＧＪＥ１３／９０２",null,null,null,null,null,"0.50","1080",96]
[237,"D21222010","CG","GRSU0 チヨダカラーＧＬＧＥＲ２０　シャイングリーン",null,null,null,null,null,"0.50","1080",301]
[238,"D22Z01009","CG","GRTZ0 チヨダストロングカラーＶ３　ＧＪＥ１１",null,null,null,null,null,"0.50","1080",174]
[239,"A22Y14203","FG","OT340 フッ素ガルバリウム（色不問）",null,null,null,null,null,"0.40","115",35]
[240,"A22Y14204","FG","OT340 フッ素ガルバリウム（色不問）",null,null,null,null,null,"0.40","115",8]
[241,"A22Y14205","FG","OT340 フッ素ガルバリウム（色不問）",null,null,null,null,null,"0.40","115",40]
[242,"A22Y14206","FG","OT340 フッ素ガルバリウム（色不問）",null,null,null,null,null,"0.40","115",35]
[243,"A22Y14207","FG","OT340 フッ素ガルバリウム（色不問）",null,null,null,null,null,"0.40","115",12]
[244,"A22Y14208","FG","OT340 フッ素ガルバリウム（色不問）",null,null,null,null,null,"0.40","115",37]
[245,"D22510015","FG","SL7Z0 ヨドフロンGL　YF695(M)",null,null,null,null,null,"0.50","130",341]
[246,"D22510016","FG","SL7Z0 ヨドフロンGL　YF695(M)",null,null,null,null,null,"0.50","130",312]
[247,"D22510017","FG","SL7Z0 ヨドフロンGL　YF695(M)",null,null,null,null,null,"0.50","130",348]
[248,"D22510018","FG","SL7Z0 ヨドフロンGL　YF695(M)",null,null,null,null,null,"0.50","130",348]
[249,"D22510019","FG","SL7Z0 ヨドフロンGL　YF695(M)",null,null,null,null,null,"0.50","130",341]
[250,"D22510020","FG","SL7Z0 ヨドフロンGL　YF695(M)",null,null,null,null,null,"0.50","130",341]
[251,"D22510021","FG","SL7Z0 ヨドフロンGL　YF695(M)",null,null,null,null,null,"0.50","130",341]
[252,"D22X05007","CG","BKBKN GTNブラック",null,null,null,null,null,"0.40","132",79]
[253,"D22616022","CG","BKW60 耐摩カラーＳＧＬ　№６４０Ｓ　ネオブラック",null,null,null,null,null,"0.40","132",108]
[254,"D22616023","CG","BKW60 耐摩カラーＳＧＬ　№６４０Ｓ　ネオブラック",null,null,null,null,null,"0.40","132",284]
[258,"D22201018","CG","BW8J0 ストロングカラーＶ３　ＧＪＥ０４／９０２",null,null,null,null,null,"0.50","132",82]
[259,"D22201019","CG","BW8J0 ストロングカラーＶ３　ＧＪＥ０４／９０２",null,null,null,null,null,"0.50","132",275]
[269,"D22706024","CG","SLGGN GTNギングロ",null,null,null,null,null,"0.40","132",50]
[270,"D22X14008","CG","SLGGN GTNギングロ",null,null,null,null,null,"0.40","132",86]
[260,"D20316034","CS","BWG30 ＢＷＯ－１（茶）ＣＳ",null,null,null,null,null,"0.45","132",144]
[255,"D21820014","FA","BLG60 ＢＬＯ－６（濃紺）ＦＡ",null,null,null,null,null,"0.70","132",87]
[256,"D18X16019","FG","BLGL0 ＢＬＯ－６（濃紺）ＦＢ１４７１／ＲＡ１４２３",null,null,null,null,null,"0.45","132",46]
[257,"D18X16020","FG","BLGL0 ＢＬＯ－６（濃紺）ＦＢ１４７１／ＲＡ１４２３",null,null,null,null,null,"0.45","132",42]
[261,"D21Y24018","FG","BWGL0 ＢＷＯ－１（茶）ＦＮ２０２５／ＲＡ１４２３",null,null,null,null,null,"0.45","132",86]
[262,"D21X13017","FG","GLGL0 ＧＬＯ－３（グレー）ＦＡ１４５７／ＲＡ１４２３",null,null,null,null,null,"0.45","132",86]
[263,"D21922013","FG","GRGL0 ＧＲＯ－２（緑青）ＦＧ１３２１／ＲＡ１４２３",null,null,null,null,null,"0.45","132",100]
[264,"D21Z08004","FG","GRGL0 ＧＲＯ－２（緑青）ＦＧ１３２１／ＲＡ１４２３",null,null,null,null,null,"0.45","132",89]
[265,"D21Z08005","FG","GRGL0 ＧＲＯ－２（緑青）ＦＧ１３２１／ＲＡ１４２３",null,null,null,null,null,"0.45","132",89]
[266,"D21Z08006","FG","GRGL0 ＧＲＯ－２（緑青）ＦＧ１３２１／ＲＡ１４２３",null,null,null,null,null,"0.45","132",89]
[267,"D19410022","FG","GRHL0 ＧＲＯ－４（モスグリーン）ＦＧ１３２４／ＲＡ１４",null,null,null,null,null,"0.45","132",140]
[268,"D20818013","FG","GRSV0 チヨダカラーＨＦ２０　ＧＨ３４２",null,null,null,null,null,"0.45","132",164]
[271,"D22329033","CG","BKBKN GTNブラック",null,null,null,null,null,"0.50","142",278]
[272,"D22Z02020","CG","BKBKN GTNブラック",null,null,null,null,null,"0.50","142",310]
[273,"D22Z02021","CG","BKBKN GTNブラック",null,null,null,null,null,"0.50","142",350]
[274,"D22Z02022","CG","BKBKN GTNブラック",null,null,null,null,null,"0.50","142",379]
[275,"D23113028","CG","BKT20 チヨダカラーＧＬＧＥＲ１０／９０２　ＳＨブラック",null,null,null,null,null,"0.50","142",30]
[276,"D23113029","CG","BKT20 チヨダカラーＧＬＧＥＲ１０／９０２　ＳＨブラック",null,null,null,null,null,"0.50","142",30]
[277,"D22829034","CG","BKY30 ヨドＨｙｐｅｒＧＬカラー萠　ＫＳ９９Ｈ黒",null,null,null,null,null,"0.40","142",148]
[286,"D22114028","CG","BW570 サンライトＧＬＲＮ８１ＲＮ２０６２（ＯＲＮ８１／",null,null,null,null,null,"0.40","142",48]
[287,"D22114029","CG","BW570 サンライトＧＬＲＮ８１ＲＮ２０６２（ＯＲＮ８１／",null,null,null,null,null,"0.40","142",48]
[288,"D22114030","CG","BW570 サンライトＧＬＲＮ８１ＲＮ２０６２（ＯＲＮ８１／",null,null,null,null,null,"0.40","142",48]
[289,"D22X07061","CG","BW7Z0 ニスクカラーPro GH ブラウンGHN22",null,null,null,null,null,"0.50","142",221]
[290,"D22X07062","CG","BW7Z0 ニスクカラーPro GH ブラウンGHN22",null,null,null,null,null,"0.50","142",221]
[291,"D22X07063","CG","BW7Z0 ニスクカラーPro GH ブラウンGHN22",null,null,null,null,null,"0.50","142",62]
[292,"D22Z26009","CG","BW8J0 ストロングカラーＶ３　ＧＪＥ０４／９０２",null,null,null,null,null,"0.40","142",76]
[293,"D23427006","CG","BW8J0 ストロングカラーＶ３　ＧＪＥ０４／９０２",null,null,null,null,null,"0.40","142",153]
[294,"D23427007","CG","BW8J0 ストロングカラーＶ３　ＧＪＥ０４／９０２",null,null,null,null,null,"0.40","142",153]
[295,"D23427008","CG","BW8J0 ストロングカラーＶ３　ＧＪＥ０４／９０２",null,null,null,null,null,"0.40","142",153]
[296,"D23427009","CG","BW8J0 ストロングカラーＶ３　ＧＪＥ０４／９０２",null,null,null,null,null,"0.40","142",153]
[297,"D23427010","CG","BW8J0 ストロングカラーＶ３　ＧＪＥ０４／９０２",null,null,null,null,null,"0.40","142",153]
[298,"D23427011","CG","BW8J0 ストロングカラーＶ３　ＧＪＥ０４／９０２",null,null,null,null,null,"0.40","142",153]
[299,"D23427012","CG","BW8J0 ストロングカラーＶ３　ＧＪＥ０４／９０２",null,null,null,null,null,"0.40","142",153]
[300,"F22722026","CG","BW8J0 ストロングカラーＶ３　ＧＪＥ０４／９０２",null,null,null,null,null,"0.40","142",101]
[304,"D20Y20022","CG","BWM40 サンライトＧＬＲＲ８０　ＲＲ２０４６（ＯＲＲ８０",null,null,null,null,null,"0.40","142",248]
[305,"D20Y20023","CG","BWM40 サンライトＧＬＲＲ８０　ＲＲ２０４６（ＯＲＲ８０",null,null,null,null,null,"0.40","142",248]
[306,"D21706017","CG","BWM40 サンライトＧＬＲＲ８０　ＲＲ２０４６（ＯＲＲ８０",null,null,null,null,null,"0.40","142",80]
[307,"A23407007","CG","GLD80 チヨダストロングカラーⅤ３ＧＪＥ１３／９０２",null,null,null,null,null,"0.40","142",80]
[308,"A23407008","CG","GLD80 チヨダストロングカラーⅤ３ＧＪＥ１３／９０２",null,null,null,null,null,"0.40","142",126]
[309,"A23407009","CG","GLD80 チヨダストロングカラーⅤ３ＧＪＥ１３／９０２",null,null,null,null,null,"0.40","142",126]
[310,"A23407010","CG","GLD80 チヨダストロングカラーⅤ３ＧＪＥ１３／９０２",null,null,null,null,null,"0.40","142",126]
[311,"A23407011","CG","GLD80 チヨダストロングカラーⅤ３ＧＪＥ１３／９０２",null,null,null,null,null,"0.40","142",126]
[312,"D22825015","CG","GLD80 チヨダストロングカラーⅤ３ＧＪＥ１３／９０２",null,null,null,null,null,"0.40","142",128]
[313,"D22825016","CG","GLD80 チヨダストロングカラーⅤ３ＧＪＥ１３／９０２",null,null,null,null,null,"0.40","142",204]
[314,"D22825017","CG","GLD80 チヨダストロングカラーⅤ３ＧＪＥ１３／９０２",null,null,null,null,null,"0.40","142",204]
[315,"D22825018","CG","GLD80 チヨダストロングカラーⅤ３ＧＪＥ１３／９０２",null,null,null,null,null,"0.40","142",204]
[316,"D22825019","CG","GLD80 チヨダストロングカラーⅤ３ＧＪＥ１３／９０２",null,null,null,null,null,"0.40","142",204]
[317,"D22825020","CG","GLD80 チヨダストロングカラーⅤ３ＧＪＥ１３／９０２",null,null,null,null,null,"0.40","142",204]
[318,"D22825021","CG","GLD80 チヨダストロングカラーⅤ３ＧＪＥ１３／９０２",null,null,null,null,null,"0.40","142",204]
[319,"D22318032","CG","GLU90 サンライトＧＬＲＭ８０（Ｍ）　ＯＲＭ８０／ＯＧＲ",null,null,null,null,null,"0.40","142",108]
[320,"D22X14041","CG","GLVC0 ストロングカラーＶ３　ＧＪＥ３１／９０２",null,null,null,null,null,"0.40","142",88]
[321,"D19920004","CG","GR5D0 サンライトＧＬＲＧ８５　ＯＲＧ８５／ＯＲＧ",null,null,null,null,null,"0.50","142",68]
[322,"D19920005","CG","GR5D0 サンライトＧＬＲＧ８５　ＯＲＧ８５／ＯＲＧ",null,null,null,null,null,"0.50","142",379]
[323,"D19920006","CG","GR5D0 サンライトＧＬＲＧ８５　ＯＲＧ８５／ＯＲＧ",null,null,null,null,null,"0.50","142",379]
[324,"D19920007","CG","GR5D0 サンライトＧＬＲＧ８５　ＯＲＧ８５／ＯＲＧ",null,null,null,null,null,"0.50","142",379]
[325,"D19920010","CG","GR5D0 サンライトＧＬＲＧ８５　ＯＲＧ８５／ＯＲＧ",null,null,null,null,null,"0.50","142",342]
[326,"D19920011","CG","GR5D0 サンライトＧＬＲＧ８５　ＯＲＧ８５／ＯＲＧ",null,null,null,null,null,"0.50","142",196]
[327,"D19920012","CG","GR5D0 サンライトＧＬＲＧ８５　ＯＲＧ８５／ＯＲＧ",null,null,null,null,null,"0.50","142",196]
[328,"D19920013","CG","GR5D0 サンライトＧＬＲＧ８５　ＯＲＧ８５／ＯＲＧ",null,null,null,null,null,"0.50","142",196]
[329,"D19920014","CG","GR5D0 サンライトＧＬＲＧ８５　ＯＲＧ８５／ＯＲＧ",null,null,null,null,null,"0.50","142",196]
[330,"D19920015","CG","GR5D0 サンライトＧＬＲＧ８５　ＯＲＧ８５／ＯＲＧ",null,null,null,null,null,"0.50","142",196]
[331,"D19920016","CG","GR5D0 サンライトＧＬＲＧ８５　ＯＲＧ８５／ＯＲＧ",null,null,null,null,null,"0.50","142",196]
[332,"D19920017","CG","GR5D0 サンライトＧＬＲＧ８５　ＯＲＧ８５／ＯＲＧ",null,null,null,null,null,"0.50","142",196]
[333,"D22Y24079","CG","GRRYN GTNロクショウ",null,null,null,null,null,"0.40","142",22]
[334,"D22Y16019","CG","GRTZ0 チヨダストロングカラーＶ３　ＧＪＥ１１",null,null,null,null,null,"0.50","142",138]
[335,"D22Y01552","CG","RDC60 ストロングカラーＶ３　ＧＪＥ１２／９０２",null,null,null,null,null,"0.50","142",96]
[336,"D22Y21011","CG","RDC60 ストロングカラーＶ３　ＧＪＥ１２／９０２",null,null,null,null,null,"0.40","142",36]
[337,"D22Y21012","CG","RDC60 ストロングカラーＶ３　ＧＪＥ１２／９０２",null,null,null,null,null,"0.40","142",167]
[338,"D23113043","CG","RDC60 ストロングカラーＶ３　ＧＪＥ１２／９０２",null,null,null,null,null,"0.40","142",31]
[339,"D21524504","CG","SL2V0 ニスクカラーＲＭ０１６ギングロ（Ｍ）",null,null,null,null,null,"0.50","142",232]
[342,"D22829014","CG","SLGGN GTNギングロ",null,null,null,null,null,"0.40","142",46]
[278,"D23317001","FG","BLGL0 ＢＬＯ－６（濃紺）ＦＢ１４７１／ＲＡ１４２３",null,null,null,null,null,"0.45","142",85]
[279,"D23317002","FG","BLGL0 ＢＬＯ－６（濃紺）ＦＢ１４７１／ＲＡ１４２３",null,null,null,null,null,"0.45","142",85]
[280,"D23317003","FG","BLGL0 ＢＬＯ－６（濃紺）ＦＢ１４７１／ＲＡ１４２３",null,null,null,null,null,"0.45","142",85]
[281,"D23317004","FG","BLGL0 ＢＬＯ－６（濃紺）ＦＢ１４７１／ＲＡ１４２３",null,null,null,null,null,"0.45","142",85]
[282,"D23317005","FG","BLGL0 ＢＬＯ－６（濃紺）ＦＢ１４７１／ＲＡ１４２３",null,null,null,null,null,"0.45","142",85]
[283,"D23317006","FG","BLGL0 ＢＬＯ－６（濃紺）ＦＢ１４７１／ＲＡ１４２３",null,null,null,null,null,"0.45","142",85]
[284,"D23317007","FG","BLGL0 ＢＬＯ－６（濃紺）ＦＢ１４７１／ＲＡ１４２３",null,null,null,null,null,"0.45","142",85]
[285,"D20Z14013","FG","BW3P0 チヨダカラーＨＦ２０　ＧＨ１３２",null,null,null,null,null,"0.45","142",88]
[301,"D20731012","FG","BWGL0 ＢＷＯ－１（茶）ＦＮ２０２５／ＲＡ１４２３",null,null,null,null,null,"0.45","142",220]
[302,"D20731013","FG","BWGL0 ＢＷＯ－１（茶）ＦＮ２０２５／ＲＡ１４２３",null,null,null,null,null,"0.45","142",341]
[303,"D20731014","FG","BWGL0 ＢＷＯ－１（茶）ＦＮ２０２５／ＲＡ１４２３",null,null,null,null,null,"0.45","142",341]
[340,"F20702406","LS","SL7K0 ＪＦＥ　ＳＵＳ４４３ＣＴ　２００ＭＬメタリックシ",null,null,null,null,null,"0.40","142",71]
[341,"F20702407","LS","SL7K0 ＪＦＥ　ＳＵＳ４４３ＣＴ　２００ＭＬメタリックシ",null,null,null,null,null,"0.40","142",71]
[345,"D23307504","CG","BW8J0 ストロングカラーＶ３　ＧＪＥ０４／９０２",null,null,null,null,null,"0.45","158",67]
[346,"D23307505","CG","BW8J0 ストロングカラーＶ３　ＧＪＥ０４／９０２",null,null,null,null,null,"0.45","158",67]
[347,"D22Y25015","CG","GLD80 チヨダストロングカラーⅤ３ＧＪＥ１３／９０２",null,null,null,null,null,"0.50","158",54]
[348,"D20821505","CG","GLFA0 ＫＳ９６（Ｍ）",null,null,null,null,null,"0.50","158",168]
[349,"D22204016","CG","GLU90 サンライトＧＬＲＭ８０（Ｍ）　ＯＲＭ８０／ＯＧＲ",null,null,null,null,null,"0.40","158",55]
[350,"D22204017","CG","GLU90 サンライトＧＬＲＭ８０（Ｍ）　ＯＲＭ８０／ＯＧＲ",null,null,null,null,null,"0.40","158",55]
[351,"D22204018","CG","GLU90 サンライトＧＬＲＭ８０（Ｍ）　ＯＲＭ８０／ＯＧＲ",null,null,null,null,null,"0.40","158",55]
[352,"D22204019","CG","GLU90 サンライトＧＬＲＭ８０（Ｍ）　ＯＲＭ８０／ＯＧＲ",null,null,null,null,null,"0.40","158",55]
[353,"D22318011","CG","GLU90 サンライトＧＬＲＭ８０（Ｍ）　ＯＲＭ８０／ＯＧＲ",null,null,null,null,null,"0.60","158",217]
[354,"D22318012","CG","GLU90 サンライトＧＬＲＭ８０（Ｍ）　ＯＲＭ８０／ＯＧＲ",null,null,null,null,null,"0.60","158",217]
[355,"D23313014","CG","GLVC0 ストロングカラーＶ３　ＧＪＥ３１／９０２",null,null,null,null,null,"0.40","158",170]
[356,"D23123047","CG","GLVJ0 ニスクカラーPRO GCA51 Sマットグレー",null,null,null,null,null,"0.50","158",62]
[357,"D23123048","CG","GLVJ0 ニスクカラーPRO GCA51 Sマットグレー",null,null,null,null,null,"0.50","158",177]
[364,"D20716013","CG","GRUC0 ストロングカラーＶ３　ＧＪＥ０２　モスグリーン",null,null,null,null,null,"0.50","158",92]
[366,"D20309400","CG","SL2V0 ニスクカラーＲＭ０１６ギングロ（Ｍ）",null,null,null,null,null,"0.40","158",14]
[367,"D22818012","CG","SL4G0 チヨダストロングカラーＶ３　ＧＪＥ０８／９０２",null,null,null,null,null,"0.50","158",78]
[368,"D22818013","CG","SL4G0 チヨダストロングカラーＶ３　ＧＪＥ０８／９０２",null,null,null,null,null,"0.50","158",78]
[369,"D22818014","CG","SL4G0 チヨダストロングカラーＶ３　ＧＪＥ０８／９０２",null,null,null,null,null,"0.50","158",78]
[370,"D22818015","CG","SL4G0 チヨダストロングカラーＶ３　ＧＪＥ０８／９０２",null,null,null,null,null,"0.50","158",78]
[371,"D22818016","CG","SL4G0 チヨダストロングカラーＶ３　ＧＪＥ０８／９０２",null,null,null,null,null,"0.50","158",78]
[377,"D22X12021","CG","SL7B0 チヨダストロングＶ３　ＧＱＶ８０／９０２　（Ｍ）",null,null,null,null,null,"0.45","158",96]
[378,"D22Z14008","CG","SL7B0 チヨダストロングＶ３　ＧＱＶ８０／９０２　（Ｍ）",null,null,null,null,null,"0.45","158",38]
[379,"D22Z14009","CG","SL7B0 チヨダストロングＶ３　ＧＱＶ８０／９０２　（Ｍ）",null,null,null,null,null,"0.45","158",158]
[380,"D22Z14010","CG","SL7B0 チヨダストロングＶ３　ＧＱＶ８０／９０２　（Ｍ）",null,null,null,null,null,"0.45","158",158]
[381,"D22Z14011","CG","SL7B0 チヨダストロングＶ３　ＧＱＶ８０／９０２　（Ｍ）",null,null,null,null,null,"0.45","158",158]
[382,"D22Z14012","CG","SL7B0 チヨダストロングＶ３　ＧＱＶ８０／９０２　（Ｍ）",null,null,null,null,null,"0.45","158",158]
[383,"D22Y28017","CG","SLGGN GTNギングロ",null,null,null,null,null,"0.50","158",86]
[384,"D22Y28018","CG","SLGGN GTNギングロ",null,null,null,null,null,"0.50","158",97]
[374,"D22822003","CS","SL4Z0 月星スワンカラーＰＮＳＨシルバー（Ｍ）",null,null,null,null,null,"0.40","158",52]
[375,"D22822004","CS","SL4Z0 月星スワンカラーＰＮＳＨシルバー（Ｍ）",null,null,null,null,null,"0.40","158",70]
[376,"D22822005","CS","SL4Z0 月星スワンカラーＰＮＳＨシルバー（Ｍ）",null,null,null,null,null,"0.40","158",70]
[343,"D21X07023","FG","BKGL0 ＢＫＯ－５（黒）　ＦＫ２０１８／ＲＡ１４２３",null,null,null,null,null,"0.45","158",24]
[344,"D21917021","FG","BLGL0 ＢＬＯ－６（濃紺）ＦＢ１４７１／ＲＡ１４２３",null,null,null,null,null,"0.45","158",150]
[358,"D22830007","FG","GRSE0 チヨダカラーＨＦ２０　ＧＨ２",null,null,null,null,null,"0.50","158",130]
[359,"D22830008","FG","GRSE0 チヨダカラーＨＦ２０　ＧＨ２",null,null,null,null,null,"0.50","158",130]
[360,"D22830009","FG","GRSE0 チヨダカラーＨＦ２０　ＧＨ２",null,null,null,null,null,"0.50","158",130]
[361,"D22830010","FG","GRSE0 チヨダカラーＨＦ２０　ＧＨ２",null,null,null,null,null,"0.50","158",130]
[362,"D22830011","FG","GRSE0 チヨダカラーＨＦ２０　ＧＨ２",null,null,null,null,null,"0.50","158",130]
[363,"D22830012","FG","GRSE0 チヨダカラーＨＦ２０　ＧＨ２",null,null,null,null,null,"0.50","158",130]
[372,"D21824025","FG","SL4M0 ニスクフロンＳＧＬ　ＦＭ１０８Ｓ（Ｍ）",null,null,null,null,null,"0.60","158",182]
[365,"D20406401","LS","SGD10 Ｕ－２４ＤＳ素地",null,null,null,null,null,"0.40","158",208]
[373,"D22Y18002","UF","SL4U0 ハイレタンＵＺ５３１ギングロ（ＳＧＬ）（Ｍ）",null,null,null,null,null,"0.40","158",389]
[388,"D23522020","CG","GLVC0 ストロングカラーＶ３　ＧＪＥ３１／９０２",null,null,null,null,null,"0.50","172",147]
[389,"D23522021","CG","GLVC0 ストロングカラーＶ３　ＧＪＥ３１／９０２",null,null,null,null,null,"0.50","172",147]
[390,"D23522022","CG","GLVC0 ストロングカラーＶ３　ＧＪＥ３１／９０２",null,null,null,null,null,"0.50","172",147]
[391,"D23522023","CG","GLVC0 ストロングカラーＶ３　ＧＪＥ３１／９０２",null,null,null,null,null,"0.50","172",147]
[392,"D23522024","CG","GLVC0 ストロングカラーＶ３　ＧＪＥ３１／９０２",null,null,null,null,null,"0.50","172",147]
[393,"D23522025","CG","GLVC0 ストロングカラーＶ３　ＧＪＥ３１／９０２",null,null,null,null,null,"0.50","172",341]
[394,"D23525026","CG","GLVC0 ストロングカラーＶ３　ＧＪＥ３１／９０２",null,null,null,null,null,"0.50","172",341]
[395,"D23525027","CG","GLVC0 ストロングカラーＶ３　ＧＪＥ３１／９０２",null,null,null,null,null,"0.50","172",341]
[396,"D23525028","CG","GLVC0 ストロングカラーＶ３　ＧＪＥ３１／９０２",null,null,null,null,null,"0.50","172",341]
[397,"D23525029","CG","GLVC0 ストロングカラーＶ３　ＧＪＥ３１／９０２",null,null,null,null,null,"0.50","172",341]
[398,"D22Y18503","CG","GRMGN GTNモスグリーン",null,null,null,null,null,"0.40","172",28]
[399,"D22Y18504","CG","GRMGN GTNモスグリーン",null,null,null,null,null,"0.40","172",131]
[400,"D22Y18505","CG","GRMGN GTNモスグリーン",null,null,null,null,null,"0.40","172",131]
[401,"D22801008","CG","GRTZ0 チヨダストロングカラーＶ３　ＧＪＥ１１",null,null,null,null,null,"0.50","172",178]
[402,"D23227046","CG","GRTZ0 チヨダストロングカラーＶ３　ＧＪＥ１１",null,null,null,null,null,"0.40","172",68]
[403,"F20629418","CG","RDC60 ストロングカラーＶ３　ＧＪＥ１２／９０２",null,null,null,null,null,"0.50","172",242]
[404,"D21301057","CG","SL4G0 チヨダストロングカラーＶ３　ＧＪＥ０８／９０２",null,null,null,null,null,"0.60","172",344]
[405,"D21301058","CG","SL4G0 チヨダストロングカラーＶ３　ＧＪＥ０８／９０２",null,null,null,null,null,"0.60","172",126]
[406,"D22X11505","CG","SLGGN GTNギングロ",null,null,null,null,null,"0.40","172",38]
[407,"D22X11506","CG","SLGGN GTNギングロ",null,null,null,null,null,"0.40","172",69]
[385,"D20X07054","FG","GLGL0 ＧＬＯ－３（グレー）ＦＡ１４５７／ＲＡ１４２３",null,null,null,null,null,"0.45","172",117]
[386,"D20X07055","FG","GLGL0 ＧＬＯ－３（グレー）ＦＡ１４５７／ＲＡ１４２３",null,null,null,null,null,"0.45","172",117]
[387,"D20X07056","FG","GLGL0 ＧＬＯ－３（グレー）ＦＡ１４５７／ＲＡ１４２３",null,null,null,null,null,"0.45","172",48]
[423,"D21X19508","CA","OT970 色調不問（カラーアルミ）",null,null,null,null,null,"0.50","188",78]
[424,"D21X19509","CA","OT970 色調不問（カラーアルミ）",null,null,null,null,null,"0.50","188",243]
[425,"D21X19510","CA","OT970 色調不問（カラーアルミ）",null,null,null,null,null,"0.50","188",243]
[426,"D21X19501","CA","OT970 色調不問（カラーアルミ）",null,null,null,null,null,"0.70","188",90]
[427,"D21X19502","CA","OT970 色調不問（カラーアルミ）",null,null,null,null,null,"0.70","188",139]
[428,"D21X19503","CA","OT970 色調不問（カラーアルミ）",null,null,null,null,null,"0.70","188",139]
[429,"D21X19504","CA","OT970 色調不問（カラーアルミ）",null,null,null,null,null,"0.70","188",139]
[430,"D21X19505","CA","OT970 色調不問（カラーアルミ）",null,null,null,null,null,"0.70","188",139]
[408,"F22413304","CE","OT020 色調区分なき塩ビ鋼板",null,null,null,null,null,"0.40","188",539]
[409,"F22413305","CE","OT020 色調区分なき塩ビ鋼板",null,null,null,null,null,"0.40","188",539]
[410,"A23323401","CG","OT270 色調不問（カラーガルバリウム）",null,null,null,null,null,"0.40","188",83]
[411,"A23323402","CG","OT270 色調不問（カラーガルバリウム）",null,null,null,null,null,"0.40","188",83]
[412,"A23323403","CG","OT270 色調不問（カラーガルバリウム）",null,null,null,null,null,"0.40","188",54]
[413,"A23323404","CG","OT270 色調不問（カラーガルバリウム）",null,null,null,null,null,"0.40","188",24]
[414,"D23414501","CG","OT270 色調不問（カラーガルバリウム）",null,null,null,null,null,"0.40","188",158]
[415,"D23414502","CG","OT270 色調不問（カラーガルバリウム）",null,null,null,null,null,"0.40","188",339]
[416,"D23414503","CG","OT270 色調不問（カラーガルバリウム）",null,null,null,null,null,"0.40","188",339]
[417,"D23414504","CG","OT270 色調不問（カラーガルバリウム）",null,null,null,null,null,"0.40","188",339]
[418,"D23127501","CG","OT270 色調不問（カラーガルバリウム）",null,null,null,null,null,"0.45","188",102]
[419,"D23127502","CG","OT270 色調不問（カラーガルバリウム）",null,null,null,null,null,"0.45","188",327]
[420,"D23127503","CG","OT270 色調不問（カラーガルバリウム）",null,null,null,null,null,"0.45","188",327]
[421,"D23127504","CG","OT270 色調不問（カラーガルバリウム）",null,null,null,null,null,"0.45","188",327]
[422,"F20305039","CS","OT900 色調不問",null,null,null,null,null,"0.40","188",313]
[431,"D22926002","CG","WTP60 ニスクカラーＰＲＯ　つやありＧＣＷ０７",null,null,null,null,null,"0.60","190",376]
[432,"D21608300","CG","WTP90 ストロングカラーＶ３　ＧＪＥ２３／９０２ アイ",null,null,null,null,null,"0.60","190",210]
[433,"D23313017","CG","GLVC0 ストロングカラーＶ３　ＧＪＥ３１／９０２",null,null,null,null,null,"0.80","191",384]
[434,"D23313018","CG","GLVC0 ストロングカラーＶ３　ＧＪＥ３１／９０２",null,null,null,null,null,"0.80","191",383]
[435,"D23313019","CG","GLVC0 ストロングカラーＶ３　ＧＪＥ３１／９０２",null,null,null,null,null,"0.80","191",388]
[436,"D23313020","CG","GLVC0 ストロングカラーＶ３　ＧＪＥ３１／９０２",null,null,null,null,null,"0.80","191",387]
[437,"D23313021","CG","GLVC0 ストロングカラーＶ３　ＧＪＥ３１／９０２",null,null,null,null,null,"0.80","191",496]
[438,"D23313022","CG","GLVC0 ストロングカラーＶ３　ＧＪＥ３１／９０２",null,null,null,null,null,"0.80","191",494]
[439,"D23313023","CG","GLVC0 ストロングカラーＶ３　ＧＪＥ３１／９０２",null,null,null,null,null,"0.80","191",503]
[440,"D23313024","CG","GLVC0 ストロングカラーＶ３　ＧＪＥ３１／９０２",null,null,null,null,null,"0.80","191",500]
[441,"F22X06301","CG","BW7C0 チヨダカラー輝きＧＥＲ４１　ダークブラウン",null,null,null,null,null,"0.40","206",362]
[442,"F22X07307","CG","BWM40 サンライトＧＬＲＲ８０　ＲＲ２０４６（ＯＲＲ８０",null,null,null,null,null,"0.40","206",56]
[443,"F22X07308","CG","BWM40 サンライトＧＬＲＲ８０　ＲＲ２０４６（ＯＲＲ８０",null,null,null,null,null,"0.40","206",107]
[444,"F22X07309","CG","BWM40 サンライトＧＬＲＲ８０　ＲＲ２０４６（ＯＲＲ８０",null,null,null,null,null,"0.40","206",107]
[445,"F22X07310","CG","BWM40 サンライトＧＬＲＲ８０　ＲＲ２０４６（ＯＲＲ８０",null,null,null,null,null,"0.40","206",107]
[446,"F22X07311","CG","BWM40 サンライトＧＬＲＲ８０　ＲＲ２０４６（ＯＲＲ８０",null,null,null,null,null,"0.40","206",107]
[447,"D22413001","CG","GLU90 サンライトＧＬＲＭ８０（Ｍ）　ＯＲＭ８０／ＯＧＲ",null,null,null,null,null,"0.60","222",510]
[448,"D22413002","CG","GLU90 サンライトＧＬＲＭ８０（Ｍ）　ＯＲＭ８０／ＯＧＲ",null,null,null,null,null,"0.60","222",466]
[449,"D22413003","CG","GLU90 サンライトＧＬＲＭ８０（Ｍ）　ＯＲＭ８０／ＯＧＲ",null,null,null,null,null,"0.60","222",510]
[450,"D23508002","CG","GLVJ0 ニスクカラーPRO GCA51 Sマットグレー",null,null,null,null,null,"0.60","222",503]
[451,"D22921033","CG","GLVP0 ニスクカラーProつやあり GCA20フリント",null,null,null,null,null,"0.60","222",304]
[452,"D22X21014","CG","GLVP0 ニスクカラーProつやあり GCA20フリント",null,null,null,null,null,"0.80","222",148]
[453,"D22X21015","CG","GLVP0 ニスクカラーProつやあり GCA20フリント",null,null,null,null,null,"0.80","222",86]
[454,"D22X21016","CG","GLVP0 ニスクカラーProつやあり GCA20フリント",null,null,null,null,null,"0.80","222",130]
[455,"D22X21017","CG","GLVP0 ニスクカラーProつやあり GCA20フリント",null,null,null,null,null,"0.80","222",130]
[456,"D22X25008","CG","GLVP0 ニスクカラーProつやあり GCA20フリント",null,null,null,null,null,"0.80","222",121]
[457,"D22X25009","CG","GLVP0 ニスクカラーProつやあり GCA20フリント",null,null,null,null,null,"0.80","222",125]
[458,"D22Y25314","CG","GLZG0 チヨダカラーＧＬ輝きＧＥＲ８０　ＳＨグレー",null,null,null,null,null,"0.80","222",268]
[459,"D23426005","CG","GRRYN GTNロクショウ",null,null,null,null,null,"0.80","222",189]
[460,"D22825027","CG","GRUC0 ストロングカラーＶ３　ＧＪＥ０２　モスグリーン",null,null,null,null,null,"0.60","222",154]
[480,"D22629527","CG","SL4G0 チヨダストロングカラーＶ３　ＧＪＥ０８／９０２",null,null,null,null,null,"0.80","222",536]
[481,"D22X05015","CG","SL6A0 チヨダカラーＧＬ　輝き　ＳＨシルバー　ＧＥＲ８１",null,null,null,null,null,"0.80","222",44]
[482,"D22X05017","CG","SL6A0 チヨダカラーＧＬ　輝き　ＳＨシルバー　ＧＥＲ８１",null,null,null,null,null,"0.80","222",510]
[483,"D22X05018","CG","SL6A0 チヨダカラーＧＬ　輝き　ＳＨシルバー　ＧＥＲ８１",null,null,null,null,null,"0.80","222",510]
[484,"D21Z24026","CG","SL7F0 ニスクカラーＰＲＯ　ＧＣＭ１７　シルバー",null,null,null,null,null,"0.80","222",444]
[485,"D23130016","CG","SLGGN GTNギングロ",null,null,null,null,null,"0.60","222",202]
[486,"D23130018","CG","SLGGN GTNギングロ",null,null,null,null,null,"0.60","222",222]
[487,"D23130019","CG","SLGGN GTNギングロ",null,null,null,null,null,"0.60","222",571]
[488,"D23130020","CG","SLGGN GTNギングロ",null,null,null,null,null,"0.60","222",571]
[489,"D23526002","CG","SLGGN GTNギングロ",null,null,null,null,null,"0.80","222",590]
[490,"D22920016","CG","SLJ80 サンライトGLRM81（M）（ORM81/OGR",null,null,null,null,null,"0.60","222",332]
[491,"D23123020","CG","SLJ80 サンライトGLRM81（M）（ORM81/OGR",null,null,null,null,null,"0.60","222",584]
[492,"D23123021","CG","SLJ80 サンライトGLRM81（M）（ORM81/OGR",null,null,null,null,null,"0.60","222",578]
[493,"D23123022","CG","SLJ80 サンライトGLRM81（M）（ORM81/OGR",null,null,null,null,null,"0.60","222",575]
[494,"D22Y21014","CG","TWC80 GJE31／GJE31",null,null,null,null,null,"0.80","222",336]
[495,"D21X28015","CG","TWH60 ＧＪＥ０８／ＧＪＥ０８",null,null,null,null,null,"0.80","222",378]
[496,"D21X28016","CG","TWH60 ＧＪＥ０８／ＧＪＥ０８",null,null,null,null,null,"0.80","222",439]
[461,"D23309002","CS","RDRBS GTNレッドブラウン (日鉄ステンレス)LN71",null,null,null,null,null,"0.60","222",150]
[479,"D21820501","FG","SL2N0 チヨダカラーＨＦ２０　ＧＨ７６９／９０２（Ｍ）",null,null,null,null,null,"0.60","222",272]
[497,"D20716018","FG","WTN20 ニスクフロンＳＧＬ　ＦＷ２０１Ｓホワイト",null,null,null,null,null,"0.80","222",198]
[462,"D21Y22504","NG","SG580 ガルバリウム素地（ＪＦＥ）ＡＺ１５０",null,null,null,null,null,"0.60","222",110]
[463,"D23127003","NG","SG900 ガルバリウム素地（日鉄鋼板）ＡＺ１５０",null,null,null,null,null,"0.60","222",670]
[464,"D23127004","NG","SG900 ガルバリウム素地（日鉄鋼板）ＡＺ１５０",null,null,null,null,null,"0.60","222",490]
[465,"D23127005","NG","SG900 ガルバリウム素地（日鉄鋼板）ＡＺ１５０",null,null,null,null,null,"0.60","222",670]
[466,"D23127006","NG","SG900 ガルバリウム素地（日鉄鋼板）ＡＺ１５０",null,null,null,null,null,"0.60","222",670]
[467,"D23127007","NG","SG900 ガルバリウム素地（日鉄鋼板）ＡＺ１５０",null,null,null,null,null,"0.60","222",670]
[468,"D23127008","NG","SG900 ガルバリウム素地（日鉄鋼板）ＡＺ１５０",null,null,null,null,null,"0.60","222",670]
[469,"D23127009","NG","SG900 ガルバリウム素地（日鉄鋼板）ＡＺ１５０",null,null,null,null,null,"0.60","222",670]
[470,"D23127010","NG","SG900 ガルバリウム素地（日鉄鋼板）ＡＺ１５０",null,null,null,null,null,"0.60","222",670]
[471,"D23127011","NG","SG900 ガルバリウム素地（日鉄鋼板）ＡＺ１５０",null,null,null,null,null,"0.60","222",670]
[472,"D23127012","NG","SG900 ガルバリウム素地（日鉄鋼板）ＡＺ１５０",null,null,null,null,null,"0.60","222",670]
[473,"F22127008","NG","SG990 ガルバリウム素地（日鉄鋼板市川）",null,null,null,null,null,"0.60","222",370]
[474,"D22Y21037","NG","SGB60 ガルバリウム素地（淀）",null,null,null,null,null,"0.80","222",220]
[475,"D22Y21038","NG","SGB60 ガルバリウム素地（淀）",null,null,null,null,null,"0.80","222",681]
[476,"D22Y21039","NG","SGB60 ガルバリウム素地（淀）",null,null,null,null,null,"0.80","222",681]
[477,"D22Y21040","NG","SGB60 ガルバリウム素地（淀）",null,null,null,null,null,"0.80","222",681]
[478,"D21Z20503","NG","SGC30 ＧＬ素地（東国製鋼）",null,null,null,null,null,"0.60","222",162]
[498,"A19821017","CG","BW8J0 ストロングカラーＶ３　ＧＪＥ０４／９０２",null,null,null,null,null,"0.45","260",590]
[499,"A19821018","CG","BW8J0 ストロングカラーＶ３　ＧＪＥ０４／９０２",null,null,null,null,null,"0.45","260",590]
[500,"A17324016","FG","GL8D0 サンフロンＧＬＴＵＭ－０４（Ｍ）",null,null,null,null,null,"0.45","266",486]
[501,"A21X01508","NU","SG980 銅素地（三菱マテリアル）",null,null,null,null,null,"0.40","266",38]
[502,"D23324607","NG","SG580 ガルバリウム素地（ＪＦＥ）ＡＺ１５０",null,null,null,null,null,"0.50","303",43]
[503,"D23324608","NG","SG580 ガルバリウム素地（ＪＦＥ）ＡＺ１５０",null,null,null,null,null,"0.50","303",43]
[504,"F20Y19035","CG","BW8J0 ストロングカラーＶ３　ＧＪＥ０４／９０２",null,null,null,null,null,"0.40","326",237]
[505,"D22916031","CG","BKBKN GTNブラック",null,null,null,null,null,"0.40","330",284]
[507,"D22829039","CG","BKY30 ヨドＨｙｐｅｒＧＬカラー萠　ＫＳ９９Ｈ黒",null,null,null,null,null,"0.40","332",866]
[508,"D22829049","CG","BKY30 ヨドＨｙｐｅｒＧＬカラー萠　ＫＳ９９Ｈ黒",null,null,null,null,null,"0.40","332",680]
[509,"D22622001","CG","BKZ00 ニスクカラーPro　GHK02ブラックパール",null,null,null,null,null,"0.50","332",453]
[510,"D22622002","CG","BKZ00 ニスクカラーPro　GHK02ブラックパール",null,null,null,null,null,"0.50","332",255]
[511,"D22622003","CG","BKZ00 ニスクカラーPro　GHK02ブラックパール",null,null,null,null,null,"0.50","332",906]
[512,"D22622004","CG","BKZ00 ニスクカラーPro　GHK02ブラックパール",null,null,null,null,null,"0.50","332",906]
[513,"D22622005","CG","BKZ00 ニスクカラーPro　GHK02ブラックパール",null,null,null,null,null,"0.50","332",941]
[514,"D22622006","CG","BKZ00 ニスクカラーPro　GHK02ブラックパール",null,null,null,null,null,"0.50","332",941]
[515,"D22622007","CG","BKZ00 ニスクカラーPro　GHK02ブラックパール",null,null,null,null,null,"0.50","332",923]
[517,"D22X05002","CG","BWKCN GTNコゲチャ",null,null,null,null,null,"0.40","332",65]
[518,"D22X05003","CG","BWKCN GTNコゲチャ",null,null,null,null,null,"0.40","332",413]
[519,"D23302001","CG","GLD80 チヨダストロングカラーⅤ３ＧＪＥ１３／９０２",null,null,null,null,null,"0.40","332",677]
[520,"D23302002","CG","GLD80 チヨダストロングカラーⅤ３ＧＪＥ１３／９０２",null,null,null,null,null,"0.40","332",677]
[521,"D23302003","CG","GLD80 チヨダストロングカラーⅤ３ＧＪＥ１３／９０２",null,null,null,null,null,"0.40","332",677]
[522,"D23302004","CG","GLD80 チヨダストロングカラーⅤ３ＧＪＥ１３／９０２",null,null,null,null,null,"0.40","332",672]
[523,"D23302005","CG","GLD80 チヨダストロングカラーⅤ３ＧＪＥ１３／９０２",null,null,null,null,null,"0.40","332",672]
[524,"D23302006","CG","GLD80 チヨダストロングカラーⅤ３ＧＪＥ１３／９０２",null,null,null,null,null,"0.40","332",672]
[525,"D23302010","CG","GLD80 チヨダストロングカラーⅤ３ＧＪＥ１３／９０２",null,null,null,null,null,"0.40","332",589]
[528,"D22915009","CG","GRMGN GTNモスグリーン",null,null,null,null,null,"0.40","332",437]
[532,"D22713002","CG","SL4G0 チヨダストロングカラーＶ３　ＧＪＥ０８／９０２",null,null,null,null,null,"0.40","332",391]
[533,"D23328002","CG","SLSLN GTNシルバー",null,null,null,null,null,"0.40","332",474]
[534,"D23328003","CG","SLSLN GTNシルバー",null,null,null,null,null,"0.40","332",474]
[535,"D23328004","CG","SLSLN GTNシルバー",null,null,null,null,null,"0.40","332",450]
[506,"D21426019","FG","BKSL0 ニスクフロンＳＧＬ　ＢＫＯ－５　ＦＫ２０５５",null,null,null,null,null,"0.45","332",188]
[516,"D22204003","FG","BLGL0 ＢＬＯ－６（濃紺）ＦＢ１４７１／ＲＡ１４２３",null,null,null,null,null,"0.45","332",696]
[526,"D20X09017","FG","GRHL0 ＧＲＯ－４（モスグリーン）ＦＧ１３２４／ＲＡ１４",null,null,null,null,null,"0.45","332",439]
[527,"D21Y04008","FG","GRHL0 ＧＲＯ－４（モスグリーン）ＦＧ１３２４／ＲＡ１４",null,null,null,null,null,"0.45","332",200]
[530,"D20722001","FG","SL3C0 ニスクフロンＦＭ１０８シルバーブラック（Ｍ）",null,null,null,null,null,"0.45","332",670]
[531,"D20722002","FG","SL3C0 ニスクフロンＦＭ１０８シルバーブラック（Ｍ）",null,null,null,null,null,"0.45","332",670]
[529,"A20X08002","FS","RNG90 ＲＮＯ－７　（レンガ）F905 ＦＳ",null,null,null,null,null,"0.45","332",247]
[536,"D23215001","FG","SL6L0 ＹＦ９１１　ＫＳ９３銀黒　フッ素近似",null,null,null,null,null,"0.50","337",806]
[537,"D23215002","FG","SL6L0 ＹＦ９１１　ＫＳ９３銀黒　フッ素近似",null,null,null,null,null,"0.50","337",806]
[538,"D23215003","FG","SL6L0 ＹＦ９１１　ＫＳ９３銀黒　フッ素近似",null,null,null,null,null,"0.50","337",806]
[539,"D23215004","FG","SL6L0 ＹＦ９１１　ＫＳ９３銀黒　フッ素近似",null,null,null,null,null,"0.50","337",806]
[540,"D23215005","FG","SL6L0 ＹＦ９１１　ＫＳ９３銀黒　フッ素近似",null,null,null,null,null,"0.50","337",806]
[541,"D23215006","FG","SL6L0 ＹＦ９１１　ＫＳ９３銀黒　フッ素近似",null,null,null,null,null,"0.50","337",806]
[542,"D23215007","FG","SL6L0 ＹＦ９１１　ＫＳ９３銀黒　フッ素近似",null,null,null,null,null,"0.50","337",806]
[543,"D23215008","FG","SL6L0 ＹＦ９１１　ＫＳ９３銀黒　フッ素近似",null,null,null,null,null,"0.50","337",806]
[544,"D23215009","FG","SL6L0 ＹＦ９１１　ＫＳ９３銀黒　フッ素近似",null,null,null,null,null,"0.50","337",806]
[545,"D23215010","FG","SL6L0 ＹＦ９１１　ＫＳ９３銀黒　フッ素近似",null,null,null,null,null,"0.50","337",806]
[546,"D23215011","FG","SL6L0 ＹＦ９１１　ＫＳ９３銀黒　フッ素近似",null,null,null,null,null,"0.50","337",806]
[547,"D23215012","FG","SL6L0 ＹＦ９１１　ＫＳ９３銀黒　フッ素近似",null,null,null,null,null,"0.50","337",806]
[548,"D23215013","FG","SL6L0 ＹＦ９１１　ＫＳ９３銀黒　フッ素近似",null,null,null,null,null,"0.50","337",806]
[549,"D23215014","FG","SL6L0 ＹＦ９１１　ＫＳ９３銀黒　フッ素近似",null,null,null,null,null,"0.50","337",806]
[550,"D23215015","FG","SL6L0 ＹＦ９１１　ＫＳ９３銀黒　フッ素近似",null,null,null,null,null,"0.50","337",806]
[551,"D23215016","FG","SL6L0 ＹＦ９１１　ＫＳ９３銀黒　フッ素近似",null,null,null,null,null,"0.50","337",806]
[552,"D23215017","FG","SL6L0 ＹＦ９１１　ＫＳ９３銀黒　フッ素近似",null,null,null,null,null,"0.50","337",806]
[553,"D23215018","FG","SL6L0 ＹＦ９１１　ＫＳ９３銀黒　フッ素近似",null,null,null,null,null,"0.50","337",806]
[554,"D23215019","FG","SL6L0 ＹＦ９１１　ＫＳ９３銀黒　フッ素近似",null,null,null,null,null,"0.50","337",785]
[555,"D23215020","FG","SL6L0 ＹＦ９１１　ＫＳ９３銀黒　フッ素近似",null,null,null,null,null,"0.50","337",785]
[556,"D23215021","FG","SL6L0 ＹＦ９１１　ＫＳ９３銀黒　フッ素近似",null,null,null,null,null,"0.50","337",785]
[557,"D23215022","FG","SL6L0 ＹＦ９１１　ＫＳ９３銀黒　フッ素近似",null,null,null,null,null,"0.50","337",799]
[558,"D23215023","FG","SL6L0 ＹＦ９１１　ＫＳ９３銀黒　フッ素近似",null,null,null,null,null,"0.50","337",799]
[559,"D23215024","FG","SL6L0 ＹＦ９１１　ＫＳ９３銀黒　フッ素近似",null,null,null,null,null,"0.50","337",799]
[560,"D23215025","FG","SL6L0 ＹＦ９１１　ＫＳ９３銀黒　フッ素近似",null,null,null,null,null,"0.50","337",737]
[561,"D23215026","FG","SL6L0 ＹＦ９１１　ＫＳ９３銀黒　フッ素近似",null,null,null,null,null,"0.50","337",737]
[562,"D23215027","FG","SL6L0 ＹＦ９１１　ＫＳ９３銀黒　フッ素近似",null,null,null,null,null,"0.50","337",737]
[563,"A21210502","FG","GLGL0 ＧＬＯ－３（グレー）ＦＡ１４５７／ＲＡ１４２３",null,null,null,null,null,"0.45","345",127]
[564,"D23529001","CG","BKBKN GTNブラック",null,null,null,null,null,"0.40","353",872]
[565,"D23529002","CG","BKBKN GTNブラック",null,null,null,null,null,"0.40","353",872]
[566,"D23529003","CG","BKBKN GTNブラック",null,null,null,null,null,"0.40","353",872]
[567,"D23529004","CG","BKBKN GTNブラック",null,null,null,null,null,"0.40","353",670]
[568,"D23529005","CG","BKBKN GTNブラック",null,null,null,null,null,"0.40","353",670]
[569,"D23529006","CG","BKBKN GTNブラック",null,null,null,null,null,"0.40","353",670]
[570,"D23529007","CG","BKBKN GTNブラック",null,null,null,null,null,"0.40","353",670]
[571,"D23529008","CG","BKBKN GTNブラック",null,null,null,null,null,"0.40","353",670]
[572,"D23529009","CG","BKBKN GTNブラック",null,null,null,null,null,"0.40","353",670]
[573,"D23529010","CG","BKBKN GTNブラック",null,null,null,null,null,"0.40","353",673]
[574,"D23529011","CG","BKBKN GTNブラック",null,null,null,null,null,"0.40","353",673]
[575,"D23529012","CG","BKBKN GTNブラック",null,null,null,null,null,"0.40","353",673]
[576,"D22Z22504","CG","BKX10 ストロングカラーＶ３　ＧＪＥ０１／９０２",null,null,null,null,null,"0.40","353",310]
[577,"D22607011","CG","BW7E0 和みＦＩＴ　ＧＬつやけしＮＯ．６ブラウンＮＣ",null,null,null,null,null,"0.35","353",208]
[578,"D22607014","CG","BW7E0 和みＦＩＴ　ＧＬつやけしＮＯ．６ブラウンＮＣ",null,null,null,null,null,"0.35","353",616]
[579,"D22607015","CG","BW7E0 和みＦＩＴ　ＧＬつやけしＮＯ．６ブラウンＮＣ",null,null,null,null,null,"0.35","353",616]
[580,"D22607016","CG","BW7E0 和みＦＩＴ　ＧＬつやけしＮＯ．６ブラウンＮＣ",null,null,null,null,null,"0.35","353",616]
[581,"D22X13006","CG","BW7E0 和みＦＩＴ　ＧＬつやけしＮＯ．６ブラウンＮＣ",null,null,null,null,null,"0.35","353",803]
[582,"D22X13007","CG","BW7E0 和みＦＩＴ　ＧＬつやけしＮＯ．６ブラウンＮＣ",null,null,null,null,null,"0.35","353",803]
[583,"D22X13008","CG","BW7E0 和みＦＩＴ　ＧＬつやけしＮＯ．６ブラウンＮＣ",null,null,null,null,null,"0.35","353",803]
[584,"D22X13009","CG","BW7E0 和みＦＩＴ　ＧＬつやけしＮＯ．６ブラウンＮＣ",null,null,null,null,null,"0.35","353",807]
[585,"D22X13010","CG","BW7E0 和みＦＩＴ　ＧＬつやけしＮＯ．６ブラウンＮＣ",null,null,null,null,null,"0.35","353",807]
[586,"D22X13011","CG","BW7E0 和みＦＩＴ　ＧＬつやけしＮＯ．６ブラウンＮＣ",null,null,null,null,null,"0.35","353",807]
[587,"D22Y17010","CG","BW7E0 和みＦＩＴ　ＧＬつやけしＮＯ．６ブラウンＮＣ",null,null,null,null,null,"0.35","353",820]
[588,"D22Y17011","CG","BW7E0 和みＦＩＴ　ＧＬつやけしＮＯ．６ブラウンＮＣ",null,null,null,null,null,"0.35","353",820]
[589,"D22Y17012","CG","BW7E0 和みＦＩＴ　ＧＬつやけしＮＯ．６ブラウンＮＣ",null,null,null,null,null,"0.35","353",820]
[590,"D22Y17013","CG","BW7E0 和みＦＩＴ　ＧＬつやけしＮＯ．６ブラウンＮＣ",null,null,null,null,null,"0.35","353",803]
[591,"D22Y17014","CG","BW7E0 和みＦＩＴ　ＧＬつやけしＮＯ．６ブラウンＮＣ",null,null,null,null,null,"0.35","353",803]
[592,"D22Y17015","CG","BW7E0 和みＦＩＴ　ＧＬつやけしＮＯ．６ブラウンＮＣ",null,null,null,null,null,"0.35","353",803]
[593,"D23424035","CG","BW7E0 和みＦＩＴ　ＧＬつやけしＮＯ．６ブラウンＮＣ",null,null,null,null,null,"0.35","353",756]
[594,"D23424036","CG","BW7E0 和みＦＩＴ　ＧＬつやけしＮＯ．６ブラウンＮＣ",null,null,null,null,null,"0.35","353",756]
[595,"D23424037","CG","BW7E0 和みＦＩＴ　ＧＬつやけしＮＯ．６ブラウンＮＣ",null,null,null,null,null,"0.35","353",756]
[596,"D23424038","CG","BW7E0 和みＦＩＴ　ＧＬつやけしＮＯ．６ブラウンＮＣ",null,null,null,null,null,"0.35","353",709]
[597,"D23424039","CG","BW7E0 和みＦＩＴ　ＧＬつやけしＮＯ．６ブラウンＮＣ",null,null,null,null,null,"0.35","353",709]
[598,"D23424040","CG","BW7E0 和みＦＩＴ　ＧＬつやけしＮＯ．６ブラウンＮＣ",null,null,null,null,null,"0.35","353",709]
[599,"D23424041","CG","BW7E0 和みＦＩＴ　ＧＬつやけしＮＯ．６ブラウンＮＣ",null,null,null,null,null,"0.35","353",709]
[600,"D23424042","CG","BW7E0 和みＦＩＴ　ＧＬつやけしＮＯ．６ブラウンＮＣ",null,null,null,null,null,"0.35","353",709]
[601,"D23424043","CG","BW7E0 和みＦＩＴ　ＧＬつやけしＮＯ．６ブラウンＮＣ",null,null,null,null,null,"0.35","353",709]
[602,"D23524016","CG","GRBW0 サンライトＧＬＤＲＧ３０Ｇモスグリーン",null,null,null,null,null,"0.35","353",458]
[603,"D23524017","CG","GRBW0 サンライトＧＬＤＲＧ３０Ｇモスグリーン",null,null,null,null,null,"0.35","353",458]
[604,"D23524018","CG","GRBW0 サンライトＧＬＤＲＧ３０Ｇモスグリーン",null,null,null,null,null,"0.35","353",458]
[605,"D23524019","CG","GRBW0 サンライトＧＬＤＲＧ３０Ｇモスグリーン",null,null,null,null,null,"0.35","353",882]
[606,"D23524020","CG","GRBW0 サンライトＧＬＤＲＧ３０Ｇモスグリーン",null,null,null,null,null,"0.35","353",882]
[607,"D23524021","CG","GRBW0 サンライトＧＬＤＲＧ３０Ｇモスグリーン",null,null,null,null,null,"0.35","353",882]
[608,"D23524022","CG","GRBW0 サンライトＧＬＤＲＧ３０Ｇモスグリーン",null,null,null,null,null,"0.35","353",857]
[609,"D23524023","CG","GRBW0 サンライトＧＬＤＲＧ３０Ｇモスグリーン",null,null,null,null,null,"0.35","353",857]
[610,"D23524024","CG","GRBW0 サンライトＧＬＤＲＧ３０Ｇモスグリーン",null,null,null,null,null,"0.35","353",857]
[611,"D18809508","TI","SGE10 ＫＳ４０Ｓ　（ＨＴ１Ｍ）",null,null,null,null,null,"0.40","353",144]
[612,"D22Y21005","CG","RDC60 ストロングカラーＶ３　ＧＪＥ１２／９０２",null,null,null,null,null,"0.40","402",158]
[613,"D20Y25032","CG","GLU90 サンライトＧＬＲＭ８０（Ｍ）　ＯＲＭ８０／ＯＧＲ",null,null,null,null,null,"0.40","41",50]
[614,"D20Y25033","CG","GLU90 サンライトＧＬＲＭ８０（Ｍ）　ＯＲＭ８０／ＯＧＲ",null,null,null,null,null,"0.40","41",50]
[615,"D20Z18319","CG","GLU90 サンライトＧＬＲＭ８０（Ｍ）　ＯＲＭ８０／ＯＧＲ",null,null,null,null,null,"0.40","41",19]
[616,"D20Z18320","CG","GLU90 サンライトＧＬＲＭ８０（Ｍ）　ＯＲＭ８０／ＯＧＲ",null,null,null,null,null,"0.40","41",19]
[617,"D20Z18321","CG","GLU90 サンライトＧＬＲＭ８０（Ｍ）　ＯＲＭ８０／ＯＧＲ",null,null,null,null,null,"0.40","41",19]
[618,"D20Z18322","CG","GLU90 サンライトＧＬＲＭ８０（Ｍ）　ＯＲＭ８０／ＯＧＲ",null,null,null,null,null,"0.40","41",19]
[619,"D20Z18323","CG","GLU90 サンライトＧＬＲＭ８０（Ｍ）　ＯＲＭ８０／ＯＧＲ",null,null,null,null,null,"0.40","41",19]
[620,"D20206040","FG","BKT30 チヨダカラーＨＦ２０　ＧＨ１／９０２",null,null,null,null,null,"0.50","410",1046]
[621,"D20206041","FG","BKT30 チヨダカラーＨＦ２０　ＧＨ１／９０２",null,null,null,null,null,"0.50","410",1046]
[622,"D20206047","FG","BKT30 チヨダカラーＨＦ２０　ＧＨ１／９０２",null,null,null,null,null,"0.50","410",704]
[623,"D20206050","FG","BKT30 チヨダカラーＨＦ２０　ＧＨ１／９０２",null,null,null,null,null,"0.50","410",1048]
[624,"D20206051","FG","BKT30 チヨダカラーＨＦ２０　ＧＨ１／９０２",null,null,null,null,null,"0.50","410",1048]
[625,"F20Y24009","TI","SGF50 ＣＤ０５",null,null,null,null,null,"0.30","410",820]
[626,"F18Y22314","CA","GLG20 ＧＬＯ－３（グレー）ＣＡ",null,null,null,null,null,"0.60","415",30]
[627,"A19X08512","FG","GRSE0 チヨダカラーＨＦ２０　ＧＨ２",null,null,null,null,null,"0.50","415",276]
[628,"D22510008","FG","SL7Z0 ヨドフロンGL　YF695(M)",null,null,null,null,null,"0.50","421",1103]
[629,"D22510014","FG","SL7Z0 ヨドフロンGL　YF695(M)",null,null,null,null,null,"0.50","421",1103]
[630,"D21219003","CG","SL7R0 ヨドhyper GLカラー萠KS95H 銀黒",null,null,null,null,null,"0.50","423",134]
[631,"D23522014","CG","GLVC0 ストロングカラーＶ３　ＧＪＥ３１／９０２",null,null,null,null,null,"0.50","428",993]
[632,"D23522015","CG","GLVC0 ストロングカラーＶ３　ＧＪＥ３１／９０２",null,null,null,null,null,"0.50","428",993]
[633,"D23522016","CG","GLVC0 ストロングカラーＶ３　ＧＪＥ３１／９０２",null,null,null,null,null,"0.50","428",988]
[634,"D23522017","CG","GLVC0 ストロングカラーＶ３　ＧＪＥ３１／９０２",null,null,null,null,null,"0.50","428",988]
[635,"D23522018","CG","GLVC0 ストロングカラーＶ３　ＧＪＥ３１／９０２",null,null,null,null,null,"0.50","428",1027]
[636,"D23522019","CG","GLVC0 ストロングカラーＶ３　ＧＪＥ３１／９０２",null,null,null,null,null,"0.50","428",1027]
[637,"D22Z05002","CG","WTP90 ストロングカラーＶ３　ＧＪＥ２３／９０２ アイ",null,null,null,null,null,"0.40","428",432]
[638,"F21Y09021","CG","BW8J0 ストロングカラーＶ３　ＧＪＥ０４／９０２",null,null,null,null,null,"0.40","430",277]
[639,"D21301036","CG","SL4G0 チヨダストロングカラーＶ３　ＧＪＥ０８／９０２",null,null,null,null,null,"0.60","430",479]
[640,"D21301038","CG","SL4G0 チヨダストロングカラーＶ３　ＧＪＥ０８／９０２",null,null,null,null,null,"0.60","430",130]
[641,"D22X11503","CG","SLGGN GTNギングロ",null,null,null,null,null,"0.40","430",328]
[642,"D22Y22007","CG","WTP90 ストロングカラーＶ３　ＧＪＥ２３／９０２ アイ",null,null,null,null,null,"0.40","430",366]
[643,"D22Y01020","CG","GRMGN GTNモスグリーン",null,null,null,null,null,"0.40","435",418]
[644,"D22510001","FG","SL7Z0 ヨドフロンGL　YF695(M)",null,null,null,null,null,"0.50","443",1161]
[645,"D22510005","FG","SL7Z0 ヨドフロンGL　YF695(M)",null,null,null,null,null,"0.50","443",398]
[646,"D22510007","FG","SL7Z0 ヨドフロンGL　YF695(M)",null,null,null,null,null,"0.50","443",1161]
[647,"D22916014","CG","BKBKN GTNブラック",null,null,null,null,null,"0.40","452",596]
[649,"D21X11010","CG","BKX10 ストロングカラーＶ３　ＧＪＥ０１／９０２",null,null,null,null,null,"0.40","452",490]
[650,"D23407005","CG","BKX10 ストロングカラーＶ３　ＧＪＥ０１／９０２",null,null,null,null,null,"0.50","452",260]
[651,"D23407006","CG","BKX10 ストロングカラーＶ３　ＧＪＥ０１／９０２",null,null,null,null,null,"0.50","452",260]
[654,"D21716052","CG","RDC60 ストロングカラーＶ３　ＧＪＥ１２／９０２",null,null,null,null,null,"0.50","452",533]
[655,"D22Y21004","CG","SL4G0 チヨダストロングカラーＶ３　ＧＪＥ０８／９０２",null,null,null,null,null,"0.40","452",242]
[657,"D20904501","CG","SLJ80 サンライトGLRM81（M）（ORM81/OGR",null,null,null,null,null,"0.50","452",252]
[658,"D20904502","CG","SLJ80 サンライトGLRM81（M）（ORM81/OGR",null,null,null,null,null,"0.50","452",183]
[652,"D16204040","CS","BLH30 ＢＬＯ－８（ブルー）ＣＳ",null,null,null,null,null,"0.45","452",146]
[648,"D21Z24030","FG","BKGL0 ＢＫＯ－５（黒）　ＦＫ２０１８／ＲＡ１４２３",null,null,null,null,null,"0.45","452",586]
[653,"D21818524","FG","BLHL0 ＢＬＯ－８（ブルー）ＦＢ２０２７／ＲＡ１４２３",null,null,null,null,null,"0.45","452",594]
[656,"D22Z16057","FG","SL4M0 ニスクフロンＳＧＬ　ＦＭ１０８Ｓ（Ｍ）",null,null,null,null,null,"0.40","452",198]
[659,"D22127042","CG","BKBKN GTNブラック",null,null,null,null,null,"0.35","454",60]
[660,"D22127050","CG","BWKCN GTNコゲチャ",null,null,null,null,null,"0.35","454",46]
[661,"D22127045","CG","GRMGN GTNモスグリーン",null,null,null,null,null,"0.35","454",77]
[662,"D22127046","CG","GRMGN GTNモスグリーン",null,null,null,null,null,"0.35","454",77]
[663,"D22127053","CG","SL7M0 ニスクカラーＰＲＯ　ＧＣＭ１６　いぶし銀",null,null,null,null,null,"0.35","454",70]
[664,"D22127054","CG","SL7M0 ニスクカラーＰＲＯ　ＧＣＭ１６　いぶし銀",null,null,null,null,null,"0.35","454",77]
[665,"D21202008","CG","GR9P0 サンライトＧＬＧＲＯ－２／　（ＲＧ１４０５）",null,null,null,null,null,"0.50","455",156]
[666,"D21720056","CG","GRUC0 ストロングカラーＶ３　ＧＪＥ０２　モスグリーン",null,null,null,null,null,"0.50","455",485]
[667,"D21720057","CG","GRUC0 ストロングカラーＶ３　ＧＪＥ０２　モスグリーン",null,null,null,null,null,"0.50","455",893]
[668,"D23512005","CG","SL4G0 チヨダストロングカラーＶ３　ＧＪＥ０８／９０２",null,null,null,null,null,"0.50","455",713]
[669,"D23512006","CG","SL4G0 チヨダストロングカラーＶ３　ＧＪＥ０８／９０２",null,null,null,null,null,"0.50","455",713]
[670,"D23110507","CG","SLGGN GTNギングロ",null,null,null,null,null,"0.50","455",561]
[671,"D22907001","CG","GRTZ0 チヨダストロングカラーＶ３　ＧＪＥ１１",null,null,null,null,null,"0.50","457",236]
[672,"D23517001","CG","BKM70 サンライトＧＬＬ３０ＧＯＲＬ３０Ｇ（ＤＲＬ３０Ｇ",null,null,null,null,null,"0.35","46",576]
[673,"D23517002","CG","BKM70 サンライトＧＬＬ３０ＧＯＲＬ３０Ｇ（ＤＲＬ３０Ｇ",null,null,null,null,null,"0.35","46",576]
[674,"D23517003","CG","BKM70 サンライトＧＬＬ３０ＧＯＲＬ３０Ｇ（ＤＲＬ３０Ｇ",null,null,null,null,null,"0.35","46",480]
[675,"D23517004","CG","BKM70 サンライトＧＬＬ３０ＧＯＲＬ３０Ｇ（ＤＲＬ３０Ｇ",null,null,null,null,null,"0.35","46",693]
[676,"D23517005","CG","BKM70 サンライトＧＬＬ３０ＧＯＲＬ３０Ｇ（ＤＲＬ３０Ｇ",null,null,null,null,null,"0.35","46",693]
[677,"D23517006","CG","BKM70 サンライトＧＬＬ３０ＧＯＲＬ３０Ｇ（ＤＲＬ３０Ｇ",null,null,null,null,null,"0.35","46",693]
[678,"D23517007","CG","BKM70 サンライトＧＬＬ３０ＧＯＲＬ３０Ｇ（ＤＲＬ３０Ｇ",null,null,null,null,null,"0.35","46",693]
[679,"D23517008","CG","BKM70 サンライトＧＬＬ３０ＧＯＲＬ３０Ｇ（ＤＲＬ３０Ｇ",null,null,null,null,null,"0.35","46",693]
[680,"D23517009","CG","BKM70 サンライトＧＬＬ３０ＧＯＲＬ３０Ｇ（ＤＲＬ３０Ｇ",null,null,null,null,null,"0.35","46",693]
[681,"D23517010","CG","BKM70 サンライトＧＬＬ３０ＧＯＲＬ３０Ｇ（ＤＲＬ３０Ｇ",null,null,null,null,null,"0.35","46",679]
[682,"D23517011","CG","BKM70 サンライトＧＬＬ３０ＧＯＲＬ３０Ｇ（ＤＲＬ３０Ｇ",null,null,null,null,null,"0.35","46",679]
[683,"D23517012","CG","BKM70 サンライトＧＬＬ３０ＧＯＲＬ３０Ｇ（ＤＲＬ３０Ｇ",null,null,null,null,null,"0.35","46",679]
[684,"D23524010","CG","BKM70 サンライトＧＬＬ３０ＧＯＲＬ３０Ｇ（ＤＲＬ３０Ｇ",null,null,null,null,null,"0.35","46",345]
[685,"D23524011","CG","BKM70 サンライトＧＬＬ３０ＧＯＲＬ３０Ｇ（ＤＲＬ３０Ｇ",null,null,null,null,null,"0.35","46",414]
[686,"D23524012","CG","BKM70 サンライトＧＬＬ３０ＧＯＲＬ３０Ｇ（ＤＲＬ３０Ｇ",null,null,null,null,null,"0.35","46",414]
[687,"D23524303","CG","BWV00 サンライトＧＬＤＲＮ３０Ｇ　茶",null,null,null,null,null,"0.35","46",616]
[688,"D23524304","CG","BWV00 サンライトＧＬＤＲＮ３０Ｇ　茶",null,null,null,null,null,"0.35","46",528]
[689,"D23524305","CG","BWV00 サンライトＧＬＤＲＮ３０Ｇ　茶",null,null,null,null,null,"0.35","46",528]
[690,"D23508004","CG","GL7Y0 サンライトＧＬＭ３０Ｇメタリックグレー（Ｍ）",null,null,null,null,null,"0.35","46",582]
[691,"D23508005","CG","GL7Y0 サンライトＧＬＭ３０Ｇメタリックグレー（Ｍ）",null,null,null,null,null,"0.35","46",582]
[692,"D23508006","CG","GL7Y0 サンライトＧＬＭ３０Ｇメタリックグレー（Ｍ）",null,null,null,null,null,"0.35","46",485]
[693,"D23508007","CG","GL7Y0 サンライトＧＬＭ３０Ｇメタリックグレー（Ｍ）",null,null,null,null,null,"0.35","46",150]
[694,"D23508008","CG","GL7Y0 サンライトＧＬＭ３０Ｇメタリックグレー（Ｍ）",null,null,null,null,null,"0.35","46",150]
[695,"D23508009","CG","GL7Y0 サンライトＧＬＭ３０Ｇメタリックグレー（Ｍ）",null,null,null,null,null,"0.35","46",125]
[696,"D23508010","CG","GL7Y0 サンライトＧＬＭ３０Ｇメタリックグレー（Ｍ）",null,null,null,null,null,"0.35","46",518]
[697,"D23508011","CG","GL7Y0 サンライトＧＬＭ３０Ｇメタリックグレー（Ｍ）",null,null,null,null,null,"0.35","46",518]
[698,"D23508012","CG","GL7Y0 サンライトＧＬＭ３０Ｇメタリックグレー（Ｍ）",null,null,null,null,null,"0.35","46",518]
[699,"D23508013","CG","GL7Y0 サンライトＧＬＭ３０Ｇメタリックグレー（Ｍ）",null,null,null,null,null,"0.35","46",693]
[700,"D23508014","CG","GL7Y0 サンライトＧＬＭ３０Ｇメタリックグレー（Ｍ）",null,null,null,null,null,"0.35","46",693]
[701,"D23508015","CG","GL7Y0 サンライトＧＬＭ３０Ｇメタリックグレー（Ｍ）",null,null,null,null,null,"0.35","46",693]
[702,"D23524301","CG","GRBW0 サンライトＧＬＤＲＧ３０Ｇモスグリーン",null,null,null,null,null,"0.35","46",644]
[703,"D23524302","CG","GRBW0 サンライトＧＬＤＲＧ３０Ｇモスグリーン",null,null,null,null,null,"0.35","46",644]
[704,"D22Y21016","CG","BKBKN GTNブラック",null,null,null,null,null,"0.40","460",288]
[707,"D22804011","CG","BW7Y0 ニスクカラーPro GC GCN34（アースブラ",null,null,null,null,null,"0.50","460",334]
[708,"D22X17016","CG","GRRYN GTNロクショウ",null,null,null,null,null,"0.40","460",1073]
[709,"D23410006","CG","SL7B0 チヨダストロングＶ３　ＧＱＶ８０／９０２　（Ｍ）",null,null,null,null,null,"0.40","460",452]
[710,"D21714006","CG","SL7B0 チヨダストロングＶ３　ＧＱＶ８０／９０２　（Ｍ）",null,null,null,null,null,"0.50","460",124]
[711,"D21714007","CG","SL7B0 チヨダストロングＶ３　ＧＱＶ８０／９０２　（Ｍ）",null,null,null,null,null,"0.50","460",826]
[712,"D21714008","CG","SL7B0 チヨダストロングＶ３　ＧＱＶ８０／９０２　（Ｍ）",null,null,null,null,null,"0.50","460",102]
[714,"D23421013","CG","SLGGN GTNギングロ",null,null,null,null,null,"0.50","460",626]
[715,"D23421014","CG","SLGGN GTNギングロ",null,null,null,null,null,"0.50","460",1125]
[716,"D23421015","CG","SLGGN GTNギングロ",null,null,null,null,null,"0.50","460",1125]
[717,"D23421016","CG","SLGGN GTNギングロ",null,null,null,null,null,"0.50","460",872]
[718,"D23421017","CG","SLGGN GTNギングロ",null,null,null,null,null,"0.50","460",872]
[719,"D23421018","CG","SLGGN GTNギングロ",null,null,null,null,null,"0.50","460",437]
[720,"D23421019","CG","SLGGN GTNギングロ",null,null,null,null,null,"0.50","460",437]
[721,"D23328006","CG","SLSLN GTNシルバー",null,null,null,null,null,"0.40","460",354]
[722,"D23328007","CG","SLSLN GTNシルバー",null,null,null,null,null,"0.40","460",698]
[723,"D23328008","CG","SLSLN GTNシルバー",null,null,null,null,null,"0.40","460",698]
[705,"D20317010","FG","BKT30 チヨダカラーＨＦ２０　ＧＨ１／９０２",null,null,null,null,null,"0.50","460",798]
[706,"D20Z14001","FG","BW3P0 チヨダカラーＨＦ２０　ＧＨ１３２",null,null,null,null,null,"0.45","460",462]
[713,"D22701033","FG","SL7Y0 ヨドフロンYH203/YT1銀黒",null,null,null,null,null,"0.50","460",608]
[724,"D22Y16012","CG","GRTZ0 チヨダストロングカラーＶ３　ＧＪＥ１１",null,null,null,null,null,"0.50","462",428]
[725,"F19130031","CA","GLG20 ＧＬＯ－３（グレー）ＣＡ",null,null,null,null,null,"0.70","465",140]
[726,"D21921028","CA","SL090 ＦＷ－１００５シルバー（Ｍ）",null,null,null,null,null,"0.70","476",420]
[727,"D21Y25502","CS","BWG30 ＢＷＯ－１（茶）ＣＳ",null,null,null,null,null,"0.45","490",214]
[728,"D21Y25503","CS","BWG30 ＢＷＯ－１（茶）ＣＳ",null,null,null,null,null,"0.45","490",157]
[729,"D22Z12021","CG","BKBKN GTNブラック",null,null,null,null,null,"0.40","498",90]
[730,"D22329013","CG","BKBKN GTNブラック",null,null,null,null,null,"0.50","498",760]
[738,"D22616037","CG","BKW60 耐摩カラーＳＧＬ　№６４０Ｓ　ネオブラック",null,null,null,null,null,"0.40","498",370]
[739,"F22415002","CG","BKX10 ストロングカラーＶ３　ＧＪＥ０１／９０２",null,null,null,null,null,"0.50","498",88]
[740,"D22829023","CG","BKY30 ヨドＨｙｐｅｒＧＬカラー萠　ＫＳ９９Ｈ黒",null,null,null,null,null,"0.40","498",688]
[741,"D23525039","CG","BKY30 ヨドＨｙｐｅｒＧＬカラー萠　ＫＳ９９Ｈ黒",null,null,null,null,null,"0.50","498",1023]
[742,"D23525040","CG","BKY30 ヨドＨｙｐｅｒＧＬカラー萠　ＫＳ９９Ｈ黒",null,null,null,null,null,"0.50","498",1023]
[743,"D23525041","CG","BKY30 ヨドＨｙｐｅｒＧＬカラー萠　ＫＳ９９Ｈ黒",null,null,null,null,null,"0.50","498",1023]
[744,"D23525042","CG","BKY30 ヨドＨｙｐｅｒＧＬカラー萠　ＫＳ９９Ｈ黒",null,null,null,null,null,"0.50","498",1023]
[745,"D23525043","CG","BKY30 ヨドＨｙｐｅｒＧＬカラー萠　ＫＳ９９Ｈ黒",null,null,null,null,null,"0.50","498",1023]
[746,"D23525044","CG","BKY30 ヨドＨｙｐｅｒＧＬカラー萠　ＫＳ９９Ｈ黒",null,null,null,null,null,"0.50","498",1023]
[747,"D23525045","CG","BKY30 ヨドＨｙｐｅｒＧＬカラー萠　ＫＳ９９Ｈ黒",null,null,null,null,null,"0.50","498",1073]
[748,"D23525046","CG","BKY30 ヨドＨｙｐｅｒＧＬカラー萠　ＫＳ９９Ｈ黒",null,null,null,null,null,"0.50","498",1073]
[754,"D23118301","CG","BLXS0 ストロングカラーＶ３　ＧＪＥ０７／９０２",null,null,null,null,null,"0.50","498",376]
[756,"D22X07071","CG","BW7Z0 ニスクカラーPro GH ブラウンGHN22",null,null,null,null,null,"0.50","498",1172]
[757,"D23418002","CG","BW8J0 ストロングカラーＶ３　ＧＪＥ０４／９０２",null,null,null,null,null,"0.40","498",551]
[758,"D23418003","CG","BW8J0 ストロングカラーＶ３　ＧＪＥ０４／９０２",null,null,null,null,null,"0.40","498",551]
[759,"D23418004","CG","BW8J0 ストロングカラーＶ３　ＧＪＥ０４／９０２",null,null,null,null,null,"0.40","498",692]
[760,"D23418005","CG","BW8J0 ストロングカラーＶ３　ＧＪＥ０４／９０２",null,null,null,null,null,"0.40","498",692]
[761,"D23418006","CG","BW8J0 ストロングカラーＶ３　ＧＪＥ０４／９０２",null,null,null,null,null,"0.40","498",689]
[762,"D23418007","CG","BW8J0 ストロングカラーＶ３　ＧＪＥ０４／９０２",null,null,null,null,null,"0.40","498",689]
[763,"D23418008","CG","BW8J0 ストロングカラーＶ３　ＧＪＥ０４／９０２",null,null,null,null,null,"0.40","498",686]
[764,"D23418009","CG","BW8J0 ストロングカラーＶ３　ＧＪＥ０４／９０２",null,null,null,null,null,"0.40","498",686]
[765,"D23427002","CG","BW8J0 ストロングカラーＶ３　ＧＪＥ０４／９０２",null,null,null,null,null,"0.40","498",963]
[766,"D23427003","CG","BW8J0 ストロングカラーＶ３　ＧＪＥ０４／９０２",null,null,null,null,null,"0.40","498",963]
[767,"D23427004","CG","BW8J0 ストロングカラーＶ３　ＧＪＥ０４／９０２",null,null,null,null,null,"0.40","498",963]
[768,"D23427005","CG","BW8J0 ストロングカラーＶ３　ＧＪＥ０４／９０２",null,null,null,null,null,"0.40","498",963]
[769,"D23130031","CG","BW8J0 ストロングカラーＶ３　ＧＪＥ０４／９０２",null,null,null,null,null,"0.50","498",900]
[770,"D22Z01012","CG","BW8J0 ストロングカラーＶ３　ＧＪＥ０４／９０２",null,null,null,null,null,"0.45","498",712]
[772,"D23420326","CG","BWJ70 極みＭＡＸ　Ｋ０３１　ダークブラウンＫＮＣ",null,null,null,null,null,"0.40","498",1455]
[773,"D23420327","CG","BWJ70 極みＭＡＸ　Ｋ０３１　ダークブラウンＫＮＣ",null,null,null,null,null,"0.40","498",1455]
[774,"D23420328","CG","BWJ70 極みＭＡＸ　Ｋ０３１　ダークブラウンＫＮＣ",null,null,null,null,null,"0.40","498",1473]
[775,"D23420329","CG","BWJ70 極みＭＡＸ　Ｋ０３１　ダークブラウンＫＮＣ",null,null,null,null,null,"0.40","498",1473]
[776,"D23420330","CG","BWJ70 極みＭＡＸ　Ｋ０３１　ダークブラウンＫＮＣ",null,null,null,null,null,"0.40","498",1098]
[777,"D23420331","CG","BWJ70 極みＭＡＸ　Ｋ０３１　ダークブラウンＫＮＣ",null,null,null,null,null,"0.40","498",1066]
[778,"D23420332","CG","BWJ70 極みＭＡＸ　Ｋ０３１　ダークブラウンＫＮＣ",null,null,null,null,null,"0.40","498",1100]
[779,"D23420333","CG","BWJ70 極みＭＡＸ　Ｋ０３１　ダークブラウンＫＮＣ",null,null,null,null,null,"0.40","498",1100]
[780,"D23420334","CG","BWJ70 極みＭＡＸ　Ｋ０３１　ダークブラウンＫＮＣ",null,null,null,null,null,"0.40","498",1113]
[781,"D23420335","CG","BWJ70 極みＭＡＸ　Ｋ０３１　ダークブラウンＫＮＣ",null,null,null,null,null,"0.40","498",1113]
[782,"D23420336","CG","BWJ70 極みＭＡＸ　Ｋ０３１　ダークブラウンＫＮＣ",null,null,null,null,null,"0.40","498",1108]
[783,"D23420337","CG","BWJ70 極みＭＡＸ　Ｋ０３１　ダークブラウンＫＮＣ",null,null,null,null,null,"0.40","498",1108]
[784,"D22X07020","CG","BWKCN GTNコゲチャ",null,null,null,null,null,"0.60","498",586]
[785,"D22X07021","CG","BWKCN GTNコゲチャ",null,null,null,null,null,"0.60","498",818]
[786,"D22X07022","CG","BWKCN GTNコゲチャ",null,null,null,null,null,"0.60","498",818]
[787,"D22X07023","CG","BWKCN GTNコゲチャ",null,null,null,null,null,"0.60","498",801]
[788,"D22X07024","CG","BWKCN GTNコゲチャ",null,null,null,null,null,"0.60","498",801]
[789,"D22215028","CG","GLD80 チヨダストロングカラーⅤ３ＧＪＥ１３／９０２",null,null,null,null,null,"0.50","498",206]
[790,"D22Y25009","CG","GLD80 チヨダストロングカラーⅤ３ＧＪＥ１３／９０２",null,null,null,null,null,"0.50","498",374]
[791,"D22Y28052","CG","GLD80 チヨダストロングカラーⅤ３ＧＪＥ１３／９０２",null,null,null,null,null,"0.50","498",126]
[792,"A23407004","CG","GLD80 チヨダストロングカラーⅤ３ＧＪＥ１３／９０２",null,null,null,null,null,"0.40","498",115]
[793,"D22824078","CG","GLD80 チヨダストロングカラーⅤ３ＧＪＥ１３／９０２",null,null,null,null,null,"0.40","498",328]
[794,"D22824079","CG","GLD80 チヨダストロングカラーⅤ３ＧＪＥ１３／９０２",null,null,null,null,null,"0.40","498",872]
[795,"D22824080","CG","GLD80 チヨダストロングカラーⅤ３ＧＪＥ１３／９０２",null,null,null,null,null,"0.40","498",872]
[796,"D22824081","CG","GLD80 チヨダストロングカラーⅤ３ＧＪＥ１３／９０２",null,null,null,null,null,"0.40","498",752]
[797,"D22824082","CG","GLD80 チヨダストロングカラーⅤ３ＧＪＥ１３／９０２",null,null,null,null,null,"0.40","498",752]
[798,"D22824083","CG","GLD80 チヨダストロングカラーⅤ３ＧＪＥ１３／９０２",null,null,null,null,null,"0.40","498",752]
[799,"D22824084","CG","GLD80 チヨダストロングカラーⅤ３ＧＪＥ１３／９０２",null,null,null,null,null,"0.40","498",752]
[800,"D22Y28037","CG","GLD80 チヨダストロングカラーⅤ３ＧＪＥ１３／９０２",null,null,null,null,null,"0.40","498",510]
[801,"D20421002","CG","GLFA0 ＫＳ９６（Ｍ）",null,null,null,null,null,"0.50","498",170]
[804,"D22318020","CG","GLU90 サンライトＧＬＲＭ８０（Ｍ）　ＯＲＭ８０／ＯＧＲ",null,null,null,null,null,"0.60","498",1049]
[805,"D22318021","CG","GLU90 サンライトＧＬＲＭ８０（Ｍ）　ＯＲＭ８０／ＯＧＲ",null,null,null,null,null,"0.60","498",382]
[806,"D22Z23003","CG","GLVC0 ストロングカラーＶ３　ＧＪＥ３１／９０２",null,null,null,null,null,"0.40","498",126]
[807,"D23118002","CG","GLVC0 ストロングカラーＶ３　ＧＪＥ３１／９０２",null,null,null,null,null,"0.50","498",140]
[808,"D23313009","CG","GLVC0 ストロングカラーＶ３　ＧＪＥ３１／９０２",null,null,null,null,null,"0.80","498",830]
[809,"D23123043","CG","GLVJ0 ニスクカラーPRO GCA51 Sマットグレー",null,null,null,null,null,"0.50","498",448]
[810,"D23123044","CG","GLVJ0 ニスクカラーPRO GCA51 Sマットグレー",null,null,null,null,null,"0.50","498",1144]
[811,"D19920028","CG","GR5D0 サンライトＧＬＲＧ８５　ＯＲＧ８５／ＯＲＧ",null,null,null,null,null,"0.50","498",1175]
[812,"D19920029","CG","GR5D0 サンライトＧＬＲＧ８５　ＯＲＧ８５／ＯＲＧ",null,null,null,null,null,"0.50","498",1175]
[813,"D23529516","CG","GRRYN GTNロクショウ",null,null,null,null,null,"0.40","498",114]
[814,"F22Y28021","CG","GRRYN GTNロクショウ",null,null,null,null,null,"0.40","498",94]
[821,"D23411011","CG","GRX60 耐摩カラーSGL  517S",null,null,null,null,null,"0.50","498",381]
[822,"D23411012","CG","GRX60 耐摩カラーSGL  517S",null,null,null,null,null,"0.50","498",381]
[823,"D22914009","CG","RDC60 ストロングカラーＶ３　ＧＪＥ１２／９０２",null,null,null,null,null,"0.50","498",272]
[824,"D22Y24010","CG","RDC60 ストロングカラーＶ３　ＧＪＥ１２／９０２",null,null,null,null,null,"0.40","498",954]
[825,"D22Y24011","CG","RDC60 ストロングカラーＶ３　ＧＪＥ１２／９０２",null,null,null,null,null,"0.40","498",832]
[826,"D22Y24014","CG","RDC60 ストロングカラーＶ３　ＧＪＥ１２／９０２",null,null,null,null,null,"0.40","498",953]
[827,"D22Y24015","CG","RDC60 ストロングカラーＶ３　ＧＪＥ１２／９０２",null,null,null,null,null,"0.40","498",953]
[828,"D22Y24016","CG","RDC60 ストロングカラーＶ３　ＧＪＥ１２／９０２",null,null,null,null,null,"0.40","498",56]
[829,"D22Y24020","CG","RDC60 ストロングカラーＶ３　ＧＪＥ１２／９０２",null,null,null,null,null,"0.40","498",920]
[830,"D22Y24021","CG","RDC60 ストロングカラーＶ３　ＧＪＥ１２／９０２",null,null,null,null,null,"0.40","498",920]
[831,"D20629002","CG","RDC60 ストロングカラーＶ３　ＧＪＥ１２／９０２",null,null,null,null,null,"0.60","498",468]
[832,"D23210005","CG","RDRBN GTNレッドブラウン",null,null,null,null,null,"0.40","498",168]
[840,"D22603015","CG","SL4G0 チヨダストロングカラーＶ３　ＧＪＥ０８／９０２",null,null,null,null,null,"0.50","498",968]
[841,"D22603016","CG","SL4G0 チヨダストロングカラーＶ３　ＧＪＥ０８／９０２",null,null,null,null,null,"0.50","498",1103]
[842,"D23407024","CG","SL4G0 チヨダストロングカラーＶ３　ＧＪＥ０８／９０２",null,null,null,null,null,"0.50","498",80]
[843,"F19805045","CG","SL4G0 チヨダストロングカラーＶ３　ＧＪＥ０８／９０２",null,null,null,null,null,"0.80","498",1974]
[844,"D22X12010","CG","SL4G0 チヨダストロングカラーＶ３　ＧＪＥ０８／９０２",null,null,null,null,null,"0.40","498",144]
[845,"D22Z23021","CG","SL4G0 チヨダストロングカラーＶ３　ＧＪＥ０８／９０２",null,null,null,null,null,"0.40","498",1253]
[846,"D22Z23022","CG","SL4G0 チヨダストロングカラーＶ３　ＧＪＥ０８／９０２",null,null,null,null,null,"0.40","498",1253]
[848,"D21525343","CG","SL5T0 極みＭＡＸ　Ｋ０４５　ＫＮＣシルバーブラック（Ｍ",null,null,null,null,null,"0.60","498",318]
[849,"D22Y11024","CG","SL6A0 チヨダカラーＧＬ　輝き　ＳＨシルバー　ＧＥＲ８１",null,null,null,null,null,"0.40","498",276]
[850,"D23411003","CG","SL6D0 耐摩カラーSGL　５７０S耐摩いぶし銀（Ｍ）",null,null,null,null,null,"0.50","498",1232]
[851,"D23411004","CG","SL6D0 耐摩カラーSGL　５７０S耐摩いぶし銀（Ｍ）",null,null,null,null,null,"0.50","498",1232]
[852,"D23411005","CG","SL6D0 耐摩カラーSGL　５７０S耐摩いぶし銀（Ｍ）",null,null,null,null,null,"0.50","498",1234]
[853,"D23411006","CG","SL6D0 耐摩カラーSGL　５７０S耐摩いぶし銀（Ｍ）",null,null,null,null,null,"0.50","498",1234]
[854,"D23411007","CG","SL6D0 耐摩カラーSGL　５７０S耐摩いぶし銀（Ｍ）",null,null,null,null,null,"0.50","498",853]
[855,"D23411008","CG","SL6D0 耐摩カラーSGL　５７０S耐摩いぶし銀（Ｍ）",null,null,null,null,null,"0.50","498",853]
[856,"F19821302","CG","SL7A0 ヨドHyperハイブリッドカラーGLHB29SE",null,null,null,null,null,"0.50","498",200]
[857,"D22X12004","CG","SL7B0 チヨダストロングＶ３　ＧＱＶ８０／９０２　（Ｍ）",null,null,null,null,null,"0.40","498",318]
[858,"D23411031","CG","SL7B0 チヨダストロングＶ３　ＧＱＶ８０／９０２　（Ｍ）",null,null,null,null,null,"0.40","498",580]
[859,"D22Z14006","CG","SL7B0 チヨダストロングＶ３　ＧＱＶ８０／９０２　（Ｍ）",null,null,null,null,null,"0.45","498",222]
[860,"D23525001","CG","SL7S0 ニスクカラーpro GCM36ペールゴールド",null,null,null,null,null,"0.50","498",927]
[861,"D23525002","CG","SL7S0 ニスクカラーpro GCM36ペールゴールド",null,null,null,null,null,"0.50","498",927]
[862,"D23525003","CG","SL7S0 ニスクカラーpro GCM36ペールゴールド",null,null,null,null,null,"0.50","498",1142]
[863,"D23525004","CG","SL7S0 ニスクカラーpro GCM36ペールゴールド",null,null,null,null,null,"0.50","498",1142]
[864,"D23525005","CG","SL7S0 ニスクカラーpro GCM36ペールゴールド",null,null,null,null,null,"0.50","498",1144]
[865,"D23525006","CG","SL7S0 ニスクカラーpro GCM36ペールゴールド",null,null,null,null,null,"0.50","498",1144]
[866,"D23525007","CG","SL7S0 ニスクカラーpro GCM36ペールゴールド",null,null,null,null,null,"0.50","498",961]
[867,"D23525008","CG","SL7S0 ニスクカラーpro GCM36ペールゴールド",null,null,null,null,null,"0.50","498",961]
[868,"D23525009","CG","SL7S0 ニスクカラーpro GCM36ペールゴールド",null,null,null,null,null,"0.50","498",178]
[869,"D23525010","CG","SL7S0 ニスクカラーpro GCM36ペールゴールド",null,null,null,null,null,"0.50","498",178]
[872,"D23130011","CG","SLGGN GTNギングロ",null,null,null,null,null,"0.50","498",116]
[873,"D22X14027","CG","SLGGN GTNギングロ",null,null,null,null,null,"0.40","498",248]
[874,"D22X27015","CG","SLGGN GTNギングロ",null,null,null,null,null,"0.40","498",32]
[875,"D22Z16066","CG","SLGGN GTNギングロ",null,null,null,null,null,"0.40","498",544]
[876,"D22Z16067","CG","SLGGN GTNギングロ",null,null,null,null,null,"0.40","498",160]
[877,"D23317017","CG","SLGGN GTNギングロ",null,null,null,null,null,"0.40","498",816]
[878,"D23317018","CG","SLGGN GTNギングロ",null,null,null,null,null,"0.40","498",252]
[879,"D23317019","CG","SLGGN GTNギングロ",null,null,null,null,null,"0.40","498",252]
[880,"D23524508","CG","SLGGN GTNギングロ",null,null,null,null,null,"0.40","498",130]
[890,"D22617025","CG","SLSLN GTNシルバー",null,null,null,null,null,"0.40","498",470]
[891,"D22824028","CG","SLSLN GTNシルバー",null,null,null,null,null,"0.40","498",36]
[892,"D22X27026","CG","SLSLN GTNシルバー",null,null,null,null,null,"0.40","498",426]
[749,"D21820022","FA","BLG60 ＢＬＯ－６（濃紺）ＦＡ",null,null,null,null,null,"0.70","498",356]
[733,"D23512001","FG","BKT30 チヨダカラーＨＦ２０　ＧＨ１／９０２",null,null,null,null,null,"0.50","498",802]
[734,"D23512002","FG","BKT30 チヨダカラーＨＦ２０　ＧＨ１／９０２",null,null,null,null,null,"0.50","498",802]
[735,"D23512003","FG","BKT30 チヨダカラーＨＦ２０　ＧＨ１／９０２",null,null,null,null,null,"0.50","498",797]
[736,"D23512004","FG","BKT30 チヨダカラーＨＦ２０　ＧＨ１／９０２",null,null,null,null,null,"0.50","498",797]
[737,"D20608040","FG","BKT30 チヨダカラーＨＦ２０　ＧＨ１／９０２",null,null,null,null,null,"0.45","498",152]
[750,"D23317008","FG","BLGL0 ＢＬＯ－６（濃紺）ＦＢ１４７１／ＲＡ１４２３",null,null,null,null,null,"0.45","498",618]
[751,"D23317009","FG","BLGL0 ＢＬＯ－６（濃紺）ＦＢ１４７１／ＲＡ１４２３",null,null,null,null,null,"0.45","498",618]
[752,"D23317010","FG","BLGL0 ＢＬＯ－６（濃紺）ＦＢ１４７１／ＲＡ１４２３",null,null,null,null,null,"0.45","498",359]
[753,"D23317011","FG","BLGL0 ＢＬＯ－６（濃紺）ＦＢ１４７１／ＲＡ１４２３",null,null,null,null,null,"0.45","498",359]
[755,"F18109401","FG","BW3W0 ＢＷＯ－１　（淀）ＹＦ９０１",null,null,null,null,null,"0.45","498",242]
[771,"D22603503","FG","BWGL0 ＢＷＯ－１（茶）ＦＮ２０２５／ＲＡ１４２３",null,null,null,null,null,"0.60","498",234]
[802,"D22217040","FG","GLGL0 ＧＬＯ－３（グレー）ＦＡ１４５７／ＲＡ１４２３",null,null,null,null,null,"0.45","498",146]
[803,"D22217041","FG","GLGL0 ＧＬＯ－３（グレー）ＦＡ１４５７／ＲＡ１４２３",null,null,null,null,null,"0.45","498",1166]
[815,"D22830001","FG","GRSE0 チヨダカラーＨＦ２０　ＧＨ２",null,null,null,null,null,"0.50","498",695]
[816,"D22830002","FG","GRSE0 チヨダカラーＨＦ２０　ＧＨ２",null,null,null,null,null,"0.50","498",695]
[817,"D22830003","FG","GRSE0 チヨダカラーＨＦ２０　ＧＨ２",null,null,null,null,null,"0.50","498",683]
[818,"D22830004","FG","GRSE0 チヨダカラーＨＦ２０　ＧＨ２",null,null,null,null,null,"0.50","498",683]
[819,"D22830005","FG","GRSE0 チヨダカラーＨＦ２０　ＧＨ２",null,null,null,null,null,"0.50","498",205]
[820,"D22830006","FG","GRSE0 チヨダカラーＨＦ２０　ＧＨ２",null,null,null,null,null,"0.50","498",205]
[834,"D19515409","FG","SL3C0 ニスクフロンＦＭ１０８シルバーブラック（Ｍ）",null,null,null,null,null,"0.45","498",360]
[835,"D22215004","FG","SL3G0 チヨダカラーＨＦ２０　ＧＨ８０　（Ｍ）　ＧＨ８０",null,null,null,null,null,"0.40","498",812]
[836,"D22215005","FG","SL3G0 チヨダカラーＨＦ２０　ＧＨ８０　（Ｍ）　ＧＨ８０",null,null,null,null,null,"0.40","498",202]
[837,"D20708030","FG","SL3G0 チヨダカラーＨＦ２０　ＧＨ８０　（Ｍ）　ＧＨ８０",null,null,null,null,null,"0.50","498",142]
[838,"D20828053","FG","SL3G0 チヨダカラーＨＦ２０　ＧＨ８０　（Ｍ）　ＧＨ８０",null,null,null,null,null,"0.45","498",874]
[839,"D21310004","FG","SL3G0 チヨダカラーＨＦ２０　ＧＨ８０　（Ｍ）　ＧＨ８０",null,null,null,null,null,"0.45","498",318]
[870,"D21826316","FG","SL7X0 JFEカラーF20GLつやけしGLD．F8477",null,null,null,null,null,"0.50","498",600]
[871,"D21826322","FG","SL7X0 JFEカラーF20GLつやけしGLD．F8477",null,null,null,null,null,"0.50","498",384]
[881,"D20Y11017","FG","SLS30 サンフロンＧＬＴＵＭ－０５（Ｍ）",null,null,null,null,null,"0.50","498",1228]
[882,"D20Y11019","FG","SLS30 サンフロンＧＬＴＵＭ－０５（Ｍ）",null,null,null,null,null,"0.50","498",718]
[883,"D20Y11020","FG","SLS30 サンフロンＧＬＴＵＭ－０５（Ｍ）",null,null,null,null,null,"0.50","498",1300]
[884,"D20Y11021","FG","SLS30 サンフロンＧＬＴＵＭ－０５（Ｍ）",null,null,null,null,null,"0.50","498",1300]
[885,"D20Y11022","FG","SLS30 サンフロンＧＬＴＵＭ－０５（Ｍ）",null,null,null,null,null,"0.50","498",1257]
[886,"D20Y11023","FG","SLS30 サンフロンＧＬＴＵＭ－０５（Ｍ）",null,null,null,null,null,"0.50","498",1257]
[887,"D20Y11025","FG","SLS30 サンフロンＧＬＴＵＭ－０５（Ｍ）",null,null,null,null,null,"0.50","498",1259]
[888,"D20Y11028","FG","SLS30 サンフロンＧＬＴＵＭ－０５（Ｍ）",null,null,null,null,null,"0.50","498",1261]
[889,"D20Y11029","FG","SLS30 サンフロンＧＬＴＵＭ－０５（Ｍ）",null,null,null,null,null,"0.50","498",1261]
[731,"D22225007","FS","BKG90 ＢＫＯ－５（黒）F903 ＦＳ",null,null,null,null,null,"0.80","498",945]
[732,"D22225008","FS","BKG90 ＢＫＯ－５（黒）F903 ＦＳ",null,null,null,null,null,"0.80","498",945]
[833,"F21301323","LS","SG810 ＳＵＳ４４５Ｊ２　ＦＣ－４　ＤＳ",null,null,null,null,null,"0.40","498",138]
[847,"D22Y18013","UF","SL4U0 ハイレタンＵＺ５３１ギングロ（ＳＧＬ）（Ｍ）",null,null,null,null,null,"0.40","498",1028]
[893,"D22901027","CF","OT010 色調区分なきカラー鉄板",null,null,null,null,null,"0.50","50",135]
[894,"D22901028","CF","OT010 色調区分なきカラー鉄板",null,null,null,null,null,"0.50","50",135]
[895,"D22901029","CF","OT010 色調区分なきカラー鉄板",null,null,null,null,null,"0.50","50",135]
[896,"D22901030","CF","OT010 色調区分なきカラー鉄板",null,null,null,null,null,"0.50","50",135]
[897,"D23510002","CG","BKX10 ストロングカラーＶ３　ＧＪＥ０１／９０２",null,null,null,null,null,"0.50","525",994]
[898,"D23510003","CG","BKX10 ストロングカラーＶ３　ＧＪＥ０１／９０２",null,null,null,null,null,"0.50","525",994]
[899,"D23510004","CG","BKX10 ストロングカラーＶ３　ＧＪＥ０１／９０２",null,null,null,null,null,"0.50","525",990]
[900,"D23510005","CG","BKX10 ストロングカラーＶ３　ＧＪＥ０１／９０２",null,null,null,null,null,"0.50","525",990]
[901,"D23510006","CG","BKX10 ストロングカラーＶ３　ＧＪＥ０１／９０２",null,null,null,null,null,"0.50","525",1063]
[902,"D23510007","CG","BKX10 ストロングカラーＶ３　ＧＪＥ０１／９０２",null,null,null,null,null,"0.50","525",1063]
[903,"D23510008","CG","BKX10 ストロングカラーＶ３　ＧＪＥ０１／９０２",null,null,null,null,null,"0.50","525",1059]
[904,"D23510009","CG","BKX10 ストロングカラーＶ３　ＧＪＥ０１／９０２",null,null,null,null,null,"0.50","525",1059]
[905,"D23510010","CG","BKX10 ストロングカラーＶ３　ＧＪＥ０１／９０２",null,null,null,null,null,"0.50","525",1083]
[906,"D23510011","CG","BKX10 ストロングカラーＶ３　ＧＪＥ０１／９０２",null,null,null,null,null,"0.50","525",1083]
[907,"D23510012","CG","BKX10 ストロングカラーＶ３　ＧＪＥ０１／９０２",null,null,null,null,null,"0.50","525",1081]
[908,"D23510013","CG","BKX10 ストロングカラーＶ３　ＧＪＥ０１／９０２",null,null,null,null,null,"0.50","525",1081]
[909,"D23510014","CG","BKX10 ストロングカラーＶ３　ＧＪＥ０１／９０２",null,null,null,null,null,"0.50","525",950]
[910,"D23510015","CG","BKX10 ストロングカラーＶ３　ＧＪＥ０１／９０２",null,null,null,null,null,"0.50","525",950]
[911,"D23510016","CG","BKX10 ストロングカラーＶ３　ＧＪＥ０１／９０２",null,null,null,null,null,"0.50","525",942]
[912,"D23510017","CG","BKX10 ストロングカラーＶ３　ＧＪＥ０１／９０２",null,null,null,null,null,"0.50","525",942]
[913,"D23510018","CG","BKX10 ストロングカラーＶ３　ＧＪＥ０１／９０２",null,null,null,null,null,"0.50","525",940]
[914,"D23510019","CG","BKX10 ストロングカラーＶ３　ＧＪＥ０１／９０２",null,null,null,null,null,"0.50","525",940]
[915,"D23510020","CG","BKX10 ストロングカラーＶ３　ＧＪＥ０１／９０２",null,null,null,null,null,"0.50","525",976]
[916,"D23510021","CG","BKX10 ストロングカラーＶ３　ＧＪＥ０１／９０２",null,null,null,null,null,"0.50","525",976]
[917,"D23510022","CG","BKX10 ストロングカラーＶ３　ＧＪＥ０１／９０２",null,null,null,null,null,"0.50","525",974]
[918,"D23510023","CG","BKX10 ストロングカラーＶ３　ＧＪＥ０１／９０２",null,null,null,null,null,"0.50","525",974]
[919,"D23412008","CG","BW8C0 ストロングカラーV3 GJE22 ニューブラウン",null,null,null,null,null,"0.40","525",430]
[920,"D23522002","CG","BW8J0 ストロングカラーＶ３　ＧＪＥ０４／９０２",null,null,null,null,null,"0.40","525",1111]
[921,"D23522003","CG","BW8J0 ストロングカラーＶ３　ＧＪＥ０４／９０２",null,null,null,null,null,"0.40","525",1111]
[922,"D23522004","CG","BW8J0 ストロングカラーＶ３　ＧＪＥ０４／９０２",null,null,null,null,null,"0.40","525",1102]
[923,"D23522005","CG","BW8J0 ストロングカラーＶ３　ＧＪＥ０４／９０２",null,null,null,null,null,"0.40","525",1102]
[924,"D23522006","CG","BW8J0 ストロングカラーＶ３　ＧＪＥ０４／９０２",null,null,null,null,null,"0.40","525",962]
[925,"D23522007","CG","BW8J0 ストロングカラーＶ３　ＧＪＥ０４／９０２",null,null,null,null,null,"0.40","525",962]
[926,"D23522008","CG","BW8J0 ストロングカラーＶ３　ＧＪＥ０４／９０２",null,null,null,null,null,"0.40","525",959]
[927,"D23522009","CG","BW8J0 ストロングカラーＶ３　ＧＪＥ０４／９０２",null,null,null,null,null,"0.40","525",959]
[928,"D23522010","CG","BW8J0 ストロングカラーＶ３　ＧＪＥ０４／９０２",null,null,null,null,null,"0.40","525",945]
[929,"D23522011","CG","BW8J0 ストロングカラーＶ３　ＧＪＥ０４／９０２",null,null,null,null,null,"0.40","525",945]
[930,"D23522012","CG","BW8J0 ストロングカラーＶ３　ＧＪＥ０４／９０２",null,null,null,null,null,"0.40","525",943]
[931,"D23522013","CG","BW8J0 ストロングカラーＶ３　ＧＪＥ０４／９０２",null,null,null,null,null,"0.40","525",943]
[932,"D23523001","CG","BW8J0 ストロングカラーＶ３　ＧＪＥ０４／９０２",null,null,null,null,null,"0.40","525",397]
[933,"D23523002","CG","BW8J0 ストロングカラーＶ３　ＧＪＥ０４／９０２",null,null,null,null,null,"0.40","525",397]
[934,"D22726037","CG","SL8D0 チヨダカラーLXつや有　GLX760シルバー",null,null,null,null,null,"0.40","525",850]
[935,"D22726038","CG","SL8D0 チヨダカラーLXつや有　GLX760シルバー",null,null,null,null,null,"0.40","525",814]
[936,"D23113015","CG","SLGGN GTNギングロ",null,null,null,null,null,"0.40","525",740]
[937,"D23317014","CG","SLGGN GTNギングロ",null,null,null,null,null,"0.40","525",140]
[938,"D22210300","FG","GLGL0 ＧＬＯ－３（グレー）ＦＡ１４５７／ＲＡ１４２３",null,null,null,null,null,"0.45","543",110]
[939,"D22217029","FG","BWGL0 ＢＷＯ－１（茶）ＦＮ２０２５／ＲＡ１４２３",null,null,null,null,null,"0.45","545",170]
[940,"D23530500","CG","SLGGN GTNギングロ",null,null,null,null,null,"0.50","556",456]
[941,"D23310302","CG","SLSLN GTNシルバー",null,null,null,null,null,"0.40","60",24]
[942,"D23420001","NG","SG900 ガルバリウム素地（日鉄鋼板）ＡＺ１５０",null,null,null,null,null,"0.60","647",1106]
[943,"D23306306","00","00000",null,null,null,null,null,"0.40","65",805]
[944,"D23306308","00","00000",null,null,null,null,null,"0.40","65",650]
[945,"D22916030","CG","BKBKN GTNブラック",null,null,null,null,null,"0.40","65",90]
[946,"D23123014","CG","BKBKN GTNブラック",null,null,null,null,null,"0.40","65",23]
[947,"D23123015","CG","BKBKN GTNブラック",null,null,null,null,null,"0.40","65",19]
[949,"D20805018","CG","BKK50 サンライトＧＬＲＮ８３ＲＮ２０６３（ＥＲＮ８３／",null,null,null,null,null,"0.40","65",114]
[950,"D23529302","CG","BKV20 ニスクカラーＧＬ　ＲＫ００１Ｓ（ＳＧＬ）",null,null,null,null,null,"0.40","65",19]
[951,"D23529303","CG","BKV20 ニスクカラーＧＬ　ＲＫ００１Ｓ（ＳＧＬ）",null,null,null,null,null,"0.40","65",63]
[952,"D20Z07030","CG","BKX10 ストロングカラーＶ３　ＧＪＥ０１／９０２",null,null,null,null,null,"0.40","65",48]
[953,"D23407007","CG","BKX10 ストロングカラーＶ３　ＧＪＥ０１／９０２",null,null,null,null,null,"0.50","65",14]
[954,"D23407008","CG","BKX10 ストロングカラーＶ３　ＧＪＥ０１／９０２",null,null,null,null,null,"0.50","65",14]
[955,"D23407009","CG","BKX10 ストロングカラーＶ３　ＧＪＥ０１／９０２",null,null,null,null,null,"0.50","65",14]
[956,"D23407010","CG","BKX10 ストロングカラーＶ３　ＧＪＥ０１／９０２",null,null,null,null,null,"0.50","65",14]
[957,"D23407011","CG","BKX10 ストロングカラーＶ３　ＧＪＥ０１／９０２",null,null,null,null,null,"0.50","65",14]
[958,"D23407012","CG","BKX10 ストロングカラーＶ３　ＧＪＥ０１／９０２",null,null,null,null,null,"0.50","65",14]
[959,"D23407013","CG","BKX10 ストロングカラーＶ３　ＧＪＥ０１／９０２",null,null,null,null,null,"0.50","65",14]
[960,"D23407014","CG","BKX10 ストロングカラーＶ３　ＧＪＥ０１／９０２",null,null,null,null,null,"0.50","65",14]
[961,"D23407015","CG","BKX10 ストロングカラーＶ３　ＧＪＥ０１／９０２",null,null,null,null,null,"0.50","65",14]
[962,"D23407016","CG","BKX10 ストロングカラーＶ３　ＧＪＥ０１／９０２",null,null,null,null,null,"0.50","65",14]
[963,"D23407017","CG","BKX10 ストロングカラーＶ３　ＧＪＥ０１／９０２",null,null,null,null,null,"0.50","65",14]
[964,"D23407018","CG","BKX10 ストロングカラーＶ３　ＧＪＥ０１／９０２",null,null,null,null,null,"0.50","65",14]
[965,"D23407019","CG","BKX10 ストロングカラーＶ３　ＧＪＥ０１／９０２",null,null,null,null,null,"0.50","65",14]
[966,"D23407020","CG","BKX10 ストロングカラーＶ３　ＧＪＥ０１／９０２",null,null,null,null,null,"0.50","65",14]
[967,"D23407021","CG","BKX10 ストロングカラーＶ３　ＧＪＥ０１／９０２",null,null,null,null,null,"0.50","65",14]
[968,"D23510024","CG","BKX10 ストロングカラーＶ３　ＧＪＥ０１／９０２",null,null,null,null,null,"0.50","65",1425]
[969,"D23510025","CG","BKX10 ストロングカラーＶ３　ＧＪＥ０１／９０２",null,null,null,null,null,"0.50","65",1410]
[971,"D23522001","CG","BW8J0 ストロングカラーＶ３　ＧＪＥ０４／９０２",null,null,null,null,null,"0.40","65",1680]
[972,"D23117013","CG","BW8J0 ストロングカラーＶ３　ＧＪＥ０４／９０２",null,null,null,null,null,"0.50","65",80]
[973,"D23117014","CG","BW8J0 ストロングカラーＶ３　ＧＪＥ０４／９０２",null,null,null,null,null,"0.50","65",94]
[977,"D22Z02009","CG","BWKCN GTNコゲチャ",null,null,null,null,null,"0.40","65",38]
[978,"D22Z02010","CG","BWKCN GTNコゲチャ",null,null,null,null,null,"0.40","65",38]
[979,"D22Z12018","CG","BWKCN GTNコゲチャ",null,null,null,null,null,"0.40","65",52]
[980,"D22Z12019","CG","BWKCN GTNコゲチャ",null,null,null,null,null,"0.40","65",78]
[1000,"D20806015","CG","GLU90 サンライトＧＬＲＭ８０（Ｍ）　ＯＲＭ８０／ＯＧＲ",null,null,null,null,null,"0.40","65",28]
[1001,"D21316006","CG","GLU90 サンライトＧＬＲＭ８０（Ｍ）　ＯＲＭ８０／ＯＧＲ",null,null,null,null,null,"0.40","65",92]
[1002,"D20Y25022","CG","GR5D0 サンライトＧＬＲＧ８５　ＯＲＧ８５／ＯＲＧ",null,null,null,null,null,"0.40","65",55]
[1003,"D20Y25023","CG","GR5D0 サンライトＧＬＲＧ８５　ＯＲＧ８５／ＯＲＧ",null,null,null,null,null,"0.40","65",55]
[1004,"D22X17018","CG","GRRYN GTNロクショウ",null,null,null,null,null,"0.40","65",84]
[1005,"D22X17019","CG","GRRYN GTNロクショウ",null,null,null,null,null,"0.40","65",152]
[1006,"D23529311","CG","GRTZ0 チヨダストロングカラーＶ３　ＧＪＥ１１",null,null,null,null,null,"0.40","65",172]
[1007,"D23529312","CG","GRTZ0 チヨダストロングカラーＶ３　ＧＪＥ１１",null,null,null,null,null,"0.40","65",375]
[1008,"D21716063","CG","RDC60 ストロングカラーＶ３　ＧＪＥ１２／９０２",null,null,null,null,null,"0.50","65",35]
[1009,"D21716064","CG","RDC60 ストロングカラーＶ３　ＧＪＥ１２／９０２",null,null,null,null,null,"0.50","65",35]
[1010,"D21716065","CG","RDC60 ストロングカラーＶ３　ＧＪＥ１２／９０２",null,null,null,null,null,"0.50","65",35]
[1011,"D21716066","CG","RDC60 ストロングカラーＶ３　ＧＪＥ１２／９０２",null,null,null,null,null,"0.50","65",35]
[1012,"D21716067","CG","RDC60 ストロングカラーＶ３　ＧＪＥ１２／９０２",null,null,null,null,null,"0.50","65",35]
[1013,"D21716068","CG","RDC60 ストロングカラーＶ３　ＧＪＥ１２／９０２",null,null,null,null,null,"0.50","65",35]
[1014,"D22Y25030","CG","RDRBN GTNレッドブラウン",null,null,null,null,null,"0.40","65",44]
[1015,"D22Y25031","CG","RDRBN GTNレッドブラウン",null,null,null,null,null,"0.40","65",57]
[1016,"D22Y25032","CG","RDRBN GTNレッドブラウン",null,null,null,null,null,"0.40","65",57]
[1017,"D22Y25033","CG","RDRBN GTNレッドブラウン",null,null,null,null,null,"0.40","65",57]
[1034,"F20X26010","CG","SL4T0 ニスクカラーＳＧＬ　ＲＭ０１６Ｓ　ギングロ",null,null,null,null,null,"0.40","65",69]
[1035,"D20407301","CG","SL4T0 ニスクカラーＳＧＬ　ＲＭ０１６Ｓ　ギングロ",null,null,null,null,null,"0.50","65",135]
[1036,"D20407307","CG","SL4T0 ニスクカラーＳＧＬ　ＲＭ０１６Ｓ　ギングロ",null,null,null,null,null,"0.50","65",22]
[1037,"D21705017","CG","SL7B0 チヨダストロングＶ３　ＧＱＶ８０／９０２　（Ｍ）",null,null,null,null,null,"0.50","65",79]
[1038,"D21705018","CG","SL7B0 チヨダストロングＶ３　ＧＱＶ８０／９０２　（Ｍ）",null,null,null,null,null,"0.50","65",81]
[1039,"D21705019","CG","SL7B0 チヨダストロングＶ３　ＧＱＶ８０／９０２　（Ｍ）",null,null,null,null,null,"0.50","65",81]
[1040,"D21705020","CG","SL7B0 チヨダストロングＶ３　ＧＱＶ８０／９０２　（Ｍ）",null,null,null,null,null,"0.50","65",81]
[1041,"D21714016","CG","SL7B0 チヨダストロングＶ３　ＧＱＶ８０／９０２　（Ｍ）",null,null,null,null,null,"0.50","65",117]
[1042,"D21714017","CG","SL7B0 チヨダストロングＶ３　ＧＱＶ８０／９０２　（Ｍ）",null,null,null,null,null,"0.50","65",117]
[1043,"D21714018","CG","SL7B0 チヨダストロングＶ３　ＧＱＶ８０／９０２　（Ｍ）",null,null,null,null,null,"0.50","65",92]
[1044,"D21714019","CG","SL7B0 チヨダストロングＶ３　ＧＱＶ８０／９０２　（Ｍ）",null,null,null,null,null,"0.50","65",92]
[1045,"D21714020","CG","SL7B0 チヨダストロングＶ３　ＧＱＶ８０／９０２　（Ｍ）",null,null,null,null,null,"0.50","65",92]
[1046,"D21714021","CG","SL7B0 チヨダストロングＶ３　ＧＱＶ８０／９０２　（Ｍ）",null,null,null,null,null,"0.50","65",92]
[1047,"D21714022","CG","SL7B0 チヨダストロングＶ３　ＧＱＶ８０／９０２　（Ｍ）",null,null,null,null,null,"0.50","65",91]
[1048,"D21714023","CG","SL7B0 チヨダストロングＶ３　ＧＱＶ８０／９０２　（Ｍ）",null,null,null,null,null,"0.50","65",91]
[1049,"D21714024","CG","SL7B0 チヨダストロングＶ３　ＧＱＶ８０／９０２　（Ｍ）",null,null,null,null,null,"0.50","65",90]
[1050,"D21714025","CG","SL7B0 チヨダストロングＶ３　ＧＱＶ８０／９０２　（Ｍ）",null,null,null,null,null,"0.50","65",90]
[1051,"D22119014","CG","SL7M0 ニスクカラーＰＲＯ　ＧＣＭ１６　いぶし銀",null,null,null,null,null,"0.50","65",140]
[1052,"D22119015","CG","SL7M0 ニスクカラーＰＲＯ　ＧＣＭ１６　いぶし銀",null,null,null,null,null,"0.50","65",177]
[1057,"D22X14001","CG","SLGGN GTNギングロ",null,null,null,null,null,"0.40","65",40]
[1058,"D23113006","CG","SLGGN GTNギングロ",null,null,null,null,null,"0.40","65",90]
[1059,"D23113007","CG","SLGGN GTNギングロ",null,null,null,null,null,"0.40","65",44]
[1060,"D23421009","CG","SLGGN GTNギングロ",null,null,null,null,null,"0.50","65",776]
[1061,"D23421010","CG","SLGGN GTNギングロ",null,null,null,null,null,"0.50","65",159]
[1062,"D23421011","CG","SLGGN GTNギングロ",null,null,null,null,null,"0.50","65",123]
[1063,"D23421012","CG","SLGGN GTNギングロ",null,null,null,null,null,"0.50","65",62]
[1064,"D21Z24034","CG","SLJ80 サンライトGLRM81（M）（ORM81/OGR",null,null,null,null,null,"0.40","65",78]
[1065,"D22921007","CG","SLSLN GTNシルバー",null,null,null,null,null,"0.40","65",16]
[1066,"D22Z06019","CG","SLSLN GTNシルバー",null,null,null,null,null,"0.40","65",60]
[1067,"D22Z09001","CG","SLSLN GTNシルバー",null,null,null,null,null,"0.40","65",107]
[1068,"D23328009","CG","SLSLN GTNシルバー",null,null,null,null,null,"0.40","65",50]
[1069,"D23328010","CG","SLSLN GTNシルバー",null,null,null,null,null,"0.40","65",50]
[1070,"D23328011","CG","SLSLN GTNシルバー",null,null,null,null,null,"0.40","65",50]
[1071,"D23328012","CG","SLSLN GTNシルバー",null,null,null,null,null,"0.40","65",50]
[1072,"D23328013","CG","SLSLN GTNシルバー",null,null,null,null,null,"0.40","65",50]
[1073,"D23328014","CG","SLSLN GTNシルバー",null,null,null,null,null,"0.40","65",50]
[1074,"D23328015","CG","SLSLN GTNシルバー",null,null,null,null,null,"0.40","65",50]
[1075,"D23328016","CG","SLSLN GTNシルバー",null,null,null,null,null,"0.40","65",50]
[1076,"D23328017","CG","SLSLN GTNシルバー",null,null,null,null,null,"0.40","65",98]
[948,"D21X07017","FG","BKGL0 ＢＫＯ－５（黒）　ＦＫ２０１８／ＲＡ１４２３",null,null,null,null,null,"0.45","65",48]
[970,"D21616017","FG","BLGL0 ＢＬＯ－６（濃紺）ＦＢ１４７１／ＲＡ１４２３",null,null,null,null,null,"0.45","65",73]
[974,"D20Y25045","FG","BWGL0 ＢＷＯ－１（茶）ＦＮ２０２５／ＲＡ１４２３",null,null,null,null,null,"0.45","65",53]
[975,"D20Y25046","FG","BWGL0 ＢＷＯ－１（茶）ＦＮ２０２５／ＲＡ１４２３",null,null,null,null,null,"0.45","65",53]
[976,"D21210301","FG","BWGL0 ＢＷＯ－１（茶）ＦＮ２０２５／ＲＡ１４２３",null,null,null,null,null,"0.45","65",37]
[981,"D20521402","FG","GLGL0 ＧＬＯ－３（グレー）ＦＡ１４５７／ＲＡ１４２３",null,null,null,null,null,"0.50","65",38]
[982,"D21119016","FG","GLGL0 ＧＬＯ－３（グレー）ＦＡ１４５７／ＲＡ１４２３",null,null,null,null,null,"0.45","65",26]
[983,"D21Y05017","FG","GLGL0 ＧＬＯ－３（グレー）ＦＡ１４５７／ＲＡ１４２３",null,null,null,null,null,"0.45","65",55]
[984,"D21Y05018","FG","GLGL0 ＧＬＯ－３（グレー）ＦＡ１４５７／ＲＡ１４２３",null,null,null,null,null,"0.45","65",55]
[985,"D21Y05019","FG","GLGL0 ＧＬＯ－３（グレー）ＦＡ１４５７／ＲＡ１４２３",null,null,null,null,null,"0.45","65",55]
[986,"D21Y05020","FG","GLGL0 ＧＬＯ－３（グレー）ＦＡ１４５７／ＲＡ１４２３",null,null,null,null,null,"0.45","65",55]
[987,"D21922302","FG","GLJ10 チヨダカラーＨＦ２０　ＧＨ７４１",null,null,null,null,null,"0.40","65",23]
[988,"D21922303","FG","GLJ10 チヨダカラーＨＦ２０　ＧＨ７４１",null,null,null,null,null,"0.40","65",23]
[989,"D21922304","FG","GLJ10 チヨダカラーＨＦ２０　ＧＨ７４１",null,null,null,null,null,"0.40","65",23]
[990,"D21922305","FG","GLJ10 チヨダカラーＨＦ２０　ＧＨ７４１",null,null,null,null,null,"0.40","65",23]
[991,"D21922306","FG","GLJ10 チヨダカラーＨＦ２０　ＧＨ７４１",null,null,null,null,null,"0.40","65",23]
[992,"D21922307","FG","GLJ10 チヨダカラーＨＦ２０　ＧＨ７４１",null,null,null,null,null,"0.40","65",23]
[993,"D21922308","FG","GLJ10 チヨダカラーＨＦ２０　ＧＨ７４１",null,null,null,null,null,"0.40","65",23]
[994,"D21922309","FG","GLJ10 チヨダカラーＨＦ２０　ＧＨ７４１",null,null,null,null,null,"0.40","65",23]
[995,"D21922310","FG","GLJ10 チヨダカラーＨＦ２０　ＧＨ７４１",null,null,null,null,null,"0.40","65",23]
[996,"D21922311","FG","GLJ10 チヨダカラーＨＦ２０　ＧＨ７４１",null,null,null,null,null,"0.40","65",23]
[997,"D21922312","FG","GLJ10 チヨダカラーＨＦ２０　ＧＨ７４１",null,null,null,null,null,"0.40","65",23]
[998,"D21922313","FG","GLJ10 チヨダカラーＨＦ２０　ＧＨ７４１",null,null,null,null,null,"0.40","65",23]
[999,"D21922314","FG","GLJ10 チヨダカラーＨＦ２０　ＧＨ７４１",null,null,null,null,null,"0.40","65",23]
[1033,"D21629002","FG","SL3G0 チヨダカラーＨＦ２０　ＧＨ８０　（Ｍ）　ＧＨ８０",null,null,null,null,null,"0.45","65",100]
[1053,"D22701017","FG","SL7Y0 ヨドフロンYH203/YT1銀黒",null,null,null,null,null,"0.50","65",65]
[1054,"D22701018","FG","SL7Y0 ヨドフロンYH203/YT1銀黒",null,null,null,null,null,"0.50","65",141]
[1055,"D22701019","FG","SL7Y0 ヨドフロンYH203/YT1銀黒",null,null,null,null,null,"0.50","65",141]
[1056,"D22701020","FG","SL7Y0 ヨドフロンYH203/YT1銀黒",null,null,null,null,null,"0.50","65",141]
[1018,"D21817020","ZS","SG710 亜鉛メッキステンレス（タフテンＺ）",null,null,null,null,null,"0.50","65",101]
[1019,"D21817021","ZS","SG710 亜鉛メッキステンレス（タフテンＺ）",null,null,null,null,null,"0.50","65",101]
[1020,"D21817022","ZS","SG710 亜鉛メッキステンレス（タフテンＺ）",null,null,null,null,null,"0.50","65",101]
[1021,"D21817023","ZS","SG710 亜鉛メッキステンレス（タフテンＺ）",null,null,null,null,null,"0.50","65",101]
[1022,"D21817024","ZS","SG710 亜鉛メッキステンレス（タフテンＺ）",null,null,null,null,null,"0.50","65",101]
[1023,"D21817025","ZS","SG710 亜鉛メッキステンレス（タフテンＺ）",null,null,null,null,null,"0.50","65",101]
[1024,"D21817026","ZS","SG710 亜鉛メッキステンレス（タフテンＺ）",null,null,null,null,null,"0.50","65",101]
[1025,"D21817027","ZS","SG710 亜鉛メッキステンレス（タフテンＺ）",null,null,null,null,null,"0.50","65",101]
[1026,"D21817028","ZS","SG710 亜鉛メッキステンレス（タフテンＺ）",null,null,null,null,null,"0.50","65",101]
[1027,"D21817029","ZS","SG710 亜鉛メッキステンレス（タフテンＺ）",null,null,null,null,null,"0.50","65",101]
[1028,"D21817030","ZS","SG710 亜鉛メッキステンレス（タフテンＺ）",null,null,null,null,null,"0.50","65",101]
[1029,"D21817031","ZS","SG710 亜鉛メッキステンレス（タフテンＺ）",null,null,null,null,null,"0.50","65",101]
[1030,"D21817032","ZS","SG710 亜鉛メッキステンレス（タフテンＺ）",null,null,null,null,null,"0.50","65",101]
[1031,"D21817033","ZS","SG710 亜鉛メッキステンレス（タフテンＺ）",null,null,null,null,null,"0.50","65",101]
[1032,"D21817034","ZS","SG710 亜鉛メッキステンレス（タフテンＺ）",null,null,null,null,null,"0.50","65",101]
[1078,"D22413006","CG","GLU90 サンライトＧＬＲＭ８０（Ｍ）　ＯＲＭ８０／ＯＧＲ",null,null,null,null,null,"0.60","651",194]
[1079,"D22413007","CG","GLU90 サンライトＧＬＲＭ８０（Ｍ）　ＯＲＭ８０／ＯＧＲ",null,null,null,null,null,"0.60","651",1498]
[1080,"F23206310","CG","GLVC0 ストロングカラーＶ３　ＧＪＥ３１／９０２",null,null,null,null,null,"0.80","651",618]
[1081,"D22Y04013","CG","GLVJ0 ニスクカラーPRO GCA51 Sマットグレー",null,null,null,null,null,"0.60","651",280]
[1082,"D23508001","CG","GLVJ0 ニスクカラーPRO GCA51 Sマットグレー",null,null,null,null,null,"0.60","651",1474]
[1083,"D22921034","CG","GLVP0 ニスクカラーProつやあり GCA20フリント",null,null,null,null,null,"0.60","651",586]
[1084,"D22X21019","CG","GLVP0 ニスクカラーProつやあり GCA20フリント",null,null,null,null,null,"0.80","651",306]
[1085,"D22X25006","CG","GLVP0 ニスクカラーProつやあり GCA20フリント",null,null,null,null,null,"0.80","651",354]
[1086,"D22X25007","CG","GLVP0 ニスクカラーProつやあり GCA20フリント",null,null,null,null,null,"0.80","651",367]
[1087,"D23426004","CG","GRRYN GTNロクショウ",null,null,null,null,null,"0.80","651",553]
[1088,"D22825026","CG","GRUC0 ストロングカラーＶ３　ＧＪＥ０２　モスグリーン",null,null,null,null,null,"0.60","651",476]
[1091,"D22613002","CG","SL4G0 チヨダストロングカラーＶ３　ＧＪＥ０８／９０２",null,null,null,null,null,"0.80","651",134]
[1092,"D23526001","CG","SLGGN GTNギングロ",null,null,null,null,null,"0.80","651",1730]
[1093,"D23130025","CG","SLGGN GTNギングロ",null,null,null,null,null,"0.60","651",888]
[1094,"D23130026","CG","SLGGN GTNギングロ",null,null,null,null,null,"0.60","651",1677]
[1095,"D23130027","CG","SLGGN GTNギングロ",null,null,null,null,null,"0.60","651",1677]
[1096,"D23123017","CG","SLJ80 サンライトGLRM81（M）（ORM81/OGR",null,null,null,null,null,"0.60","651",1696]
[1097,"D23123018","CG","SLJ80 サンライトGLRM81（M）（ORM81/OGR",null,null,null,null,null,"0.60","651",1685]
[1098,"D22Y21013","CG","TWC80 GJE31／GJE31",null,null,null,null,null,"0.80","651",681]
[1089,"D23309001","CS","RDRBS GTNレッドブラウン (日鉄ステンレス)LN71",null,null,null,null,null,"0.60","651",362]
[1077,"D21705045","FG","GLSL0 ニスクフロンＳＧＬ　ＧＬＯ－３ FA2097",null,null,null,null,null,"0.80","651",1034]
[1099,"D20716017","FG","WTN20 ニスクフロンＳＧＬ　ＦＷ２０１Ｓホワイト",null,null,null,null,null,"0.80","651",378]
[1090,"D20707005","NG","SG900 ガルバリウム素地（日鉄鋼板）ＡＺ１５０",null,null,null,null,null,"0.80","651",1078]
[1125,"D22X25019","CA","BWE40 カラーアルミ　０４７３ローズブラウン",null,null,null,null,null,"0.70","72",63]
[1126,"D22X25028","CA","BWE40 カラーアルミ　０４７３ローズブラウン",null,null,null,null,null,"0.70","72",75]
[1127,"D22X25029","CA","BWE40 カラーアルミ　０４７３ローズブラウン",null,null,null,null,null,"0.70","72",75]
[1101,"D22829028","CG","BKY30 ヨドＨｙｐｅｒＧＬカラー萠　ＫＳ９９Ｈ黒",null,null,null,null,null,"0.40","72",22]
[1102,"D23525026","CG","BKY30 ヨドＨｙｐｅｒＧＬカラー萠　ＫＳ９９Ｈ黒",null,null,null,null,null,"0.50","72",111]
[1103,"D23525027","CG","BKY30 ヨドＨｙｐｅｒＧＬカラー萠　ＫＳ９９Ｈ黒",null,null,null,null,null,"0.50","72",111]
[1104,"D23525028","CG","BKY30 ヨドＨｙｐｅｒＧＬカラー萠　ＫＳ９９Ｈ黒",null,null,null,null,null,"0.50","72",111]
[1105,"D23525029","CG","BKY30 ヨドＨｙｐｅｒＧＬカラー萠　ＫＳ９９Ｈ黒",null,null,null,null,null,"0.50","72",111]
[1106,"D23525030","CG","BKY30 ヨドＨｙｐｅｒＧＬカラー萠　ＫＳ９９Ｈ黒",null,null,null,null,null,"0.50","72",111]
[1107,"D23525031","CG","BKY30 ヨドＨｙｐｅｒＧＬカラー萠　ＫＳ９９Ｈ黒",null,null,null,null,null,"0.50","72",111]
[1108,"D23525032","CG","BKY30 ヨドＨｙｐｅｒＧＬカラー萠　ＫＳ９９Ｈ黒",null,null,null,null,null,"0.50","72",111]
[1109,"D23525033","CG","BKY30 ヨドＨｙｐｅｒＧＬカラー萠　ＫＳ９９Ｈ黒",null,null,null,null,null,"0.50","72",111]
[1110,"D23525034","CG","BKY30 ヨドＨｙｐｅｒＧＬカラー萠　ＫＳ９９Ｈ黒",null,null,null,null,null,"0.50","72",111]
[1111,"D23525035","CG","BKY30 ヨドＨｙｐｅｒＧＬカラー萠　ＫＳ９９Ｈ黒",null,null,null,null,null,"0.50","72",111]
[1112,"D23525036","CG","BKY30 ヨドＨｙｐｅｒＧＬカラー萠　ＫＳ９９Ｈ黒",null,null,null,null,null,"0.50","72",111]
[1113,"D23525037","CG","BKY30 ヨドＨｙｐｅｒＧＬカラー萠　ＫＳ９９Ｈ黒",null,null,null,null,null,"0.50","72",111]
[1114,"D23525038","CG","BKY30 ヨドＨｙｐｅｒＧＬカラー萠　ＫＳ９９Ｈ黒",null,null,null,null,null,"0.50","72",111]
[1115,"D22Z23018","CG","BLXS0 ストロングカラーＶ３　ＧＪＥ０７／９０２",null,null,null,null,null,"0.50","72",24]
[1116,"D22Z23019","CG","BLXS0 ストロングカラーＶ３　ＧＪＥ０７／９０２",null,null,null,null,null,"0.50","72",24]
[1123,"D21922032","CG","BW570 サンライトＧＬＲＮ８１ＲＮ２０６２（ＯＲＮ８１／",null,null,null,null,null,"0.40","72",40]
[1124,"D21922033","CG","BW570 サンライトＧＬＲＮ８１ＲＮ２０６２（ＯＲＮ８１／",null,null,null,null,null,"0.40","72",54]
[1129,"D23420300","CG","BWJ70 極みＭＡＸ　Ｋ０３１　ダークブラウンＫＮＣ",null,null,null,null,null,"0.40","72",52]
[1130,"D23420301","CG","BWJ70 極みＭＡＸ　Ｋ０３１　ダークブラウンＫＮＣ",null,null,null,null,null,"0.40","72",53]
[1131,"D23420302","CG","BWJ70 極みＭＡＸ　Ｋ０３１　ダークブラウンＫＮＣ",null,null,null,null,null,"0.40","72",53]
[1132,"D23420303","CG","BWJ70 極みＭＡＸ　Ｋ０３１　ダークブラウンＫＮＣ",null,null,null,null,null,"0.40","72",53]
[1133,"D23420304","CG","BWJ70 極みＭＡＸ　Ｋ０３１　ダークブラウンＫＮＣ",null,null,null,null,null,"0.40","72",53]
[1134,"D23420305","CG","BWJ70 極みＭＡＸ　Ｋ０３１　ダークブラウンＫＮＣ",null,null,null,null,null,"0.40","72",53]
[1135,"D23420306","CG","BWJ70 極みＭＡＸ　Ｋ０３１　ダークブラウンＫＮＣ",null,null,null,null,null,"0.40","72",53]
[1136,"D23420307","CG","BWJ70 極みＭＡＸ　Ｋ０３１　ダークブラウンＫＮＣ",null,null,null,null,null,"0.40","72",53]
[1137,"D23420308","CG","BWJ70 極みＭＡＸ　Ｋ０３１　ダークブラウンＫＮＣ",null,null,null,null,null,"0.40","72",53]
[1138,"D23420309","CG","BWJ70 極みＭＡＸ　Ｋ０３１　ダークブラウンＫＮＣ",null,null,null,null,null,"0.40","72",53]
[1139,"D23420310","CG","BWJ70 極みＭＡＸ　Ｋ０３１　ダークブラウンＫＮＣ",null,null,null,null,null,"0.40","72",53]
[1140,"D23420311","CG","BWJ70 極みＭＡＸ　Ｋ０３１　ダークブラウンＫＮＣ",null,null,null,null,null,"0.40","72",53]
[1141,"D23420312","CG","BWJ70 極みＭＡＸ　Ｋ０３１　ダークブラウンＫＮＣ",null,null,null,null,null,"0.40","72",53]
[1142,"D23420313","CG","BWJ70 極みＭＡＸ　Ｋ０３１　ダークブラウンＫＮＣ",null,null,null,null,null,"0.40","72",113]
[1143,"D23420314","CG","BWJ70 極みＭＡＸ　Ｋ０３１　ダークブラウンＫＮＣ",null,null,null,null,null,"0.40","72",113]
[1144,"D23420315","CG","BWJ70 極みＭＡＸ　Ｋ０３１　ダークブラウンＫＮＣ",null,null,null,null,null,"0.40","72",113]
[1145,"D23420316","CG","BWJ70 極みＭＡＸ　Ｋ０３１　ダークブラウンＫＮＣ",null,null,null,null,null,"0.40","72",113]
[1146,"D23420317","CG","BWJ70 極みＭＡＸ　Ｋ０３１　ダークブラウンＫＮＣ",null,null,null,null,null,"0.40","72",113]
[1147,"D23420318","CG","BWJ70 極みＭＡＸ　Ｋ０３１　ダークブラウンＫＮＣ",null,null,null,null,null,"0.40","72",113]
[1148,"D23420319","CG","BWJ70 極みＭＡＸ　Ｋ０３１　ダークブラウンＫＮＣ",null,null,null,null,null,"0.40","72",113]
[1149,"D23420320","CG","BWJ70 極みＭＡＸ　Ｋ０３１　ダークブラウンＫＮＣ",null,null,null,null,null,"0.40","72",113]
[1150,"D23420321","CG","BWJ70 極みＭＡＸ　Ｋ０３１　ダークブラウンＫＮＣ",null,null,null,null,null,"0.40","72",113]
[1151,"D23420322","CG","BWJ70 極みＭＡＸ　Ｋ０３１　ダークブラウンＫＮＣ",null,null,null,null,null,"0.40","72",113]
[1152,"D23420323","CG","BWJ70 極みＭＡＸ　Ｋ０３１　ダークブラウンＫＮＣ",null,null,null,null,null,"0.40","72",113]
[1153,"D23420324","CG","BWJ70 極みＭＡＸ　Ｋ０３１　ダークブラウンＫＮＣ",null,null,null,null,null,"0.40","72",113]
[1154,"D23420325","CG","BWJ70 極みＭＡＸ　Ｋ０３１　ダークブラウンＫＮＣ",null,null,null,null,null,"0.40","72",113]
[1155,"D22X07014","CG","BWKCN GTNコゲチャ",null,null,null,null,null,"0.60","72",85]
[1156,"D22X07015","CG","BWKCN GTNコゲチャ",null,null,null,null,null,"0.60","72",98]
[1157,"D22X07016","CG","BWKCN GTNコゲチャ",null,null,null,null,null,"0.60","72",98]
[1158,"D22X07017","CG","BWKCN GTNコゲチャ",null,null,null,null,null,"0.60","72",98]
[1159,"D22X07018","CG","BWKCN GTNコゲチャ",null,null,null,null,null,"0.60","72",98]
[1160,"D22X07019","CG","BWKCN GTNコゲチャ",null,null,null,null,null,"0.60","72",98]
[1161,"F21X06030","CG","GLD80 チヨダストロングカラーⅤ３ＧＪＥ１３／９０２",null,null,null,null,null,"0.40","72",31]
[1162,"F21X06031","CG","GLD80 チヨダストロングカラーⅤ３ＧＪＥ１３／９０２",null,null,null,null,null,"0.40","72",31]
[1163,"F21X06032","CG","GLD80 チヨダストロングカラーⅤ３ＧＪＥ１３／９０２",null,null,null,null,null,"0.40","72",31]
[1164,"F21X06033","CG","GLD80 チヨダストロングカラーⅤ３ＧＪＥ１３／９０２",null,null,null,null,null,"0.40","72",31]
[1165,"F21X06035","CG","GLD80 チヨダストロングカラーⅤ３ＧＪＥ１３／９０２",null,null,null,null,null,"0.40","72",7]
[1166,"D20217408","CG","GLU90 サンライトＧＬＲＭ８０（Ｍ）　ＯＲＭ８０／ＯＧＲ",null,null,null,null,null,"0.40","72",24]
[1167,"D20Z09016","CG","GLU90 サンライトＧＬＲＭ８０（Ｍ）　ＯＲＭ８０／ＯＧＲ",null,null,null,null,null,"0.40","72",56]
[1168,"D20Z09017","CG","GLU90 サンライトＧＬＲＭ８０（Ｍ）　ＯＲＭ８０／ＯＧＲ",null,null,null,null,null,"0.40","72",61]
[1169,"D22324007","CG","GLU90 サンライトＧＬＲＭ８０（Ｍ）　ＯＲＭ８０／ＯＧＲ",null,null,null,null,null,"0.50","72",64]
[1170,"D20X08013","CG","GLZX0 ニスクカラーＳＧＬ　ＲＡ０２０Ｓ",null,null,null,null,null,"0.40","72",531]
[1173,"D20629025","CG","RDC60 ストロングカラーＶ３　ＧＪＥ１２／９０２",null,null,null,null,null,"0.50","72",86]
[1174,"D20825025","CG","SL2V0 ニスクカラーＲＭ０１６ギングロ（Ｍ）",null,null,null,null,null,"0.60","72",14]
[1175,"D20825026","CG","SL2V0 ニスクカラーＲＭ０１６ギングロ（Ｍ）",null,null,null,null,null,"0.60","72",170]
[1176,"D20825027","CG","SL2V0 ニスクカラーＲＭ０１６ギングロ（Ｍ）",null,null,null,null,null,"0.60","72",170]
[1177,"D20825028","CG","SL2V0 ニスクカラーＲＭ０１６ギングロ（Ｍ）",null,null,null,null,null,"0.60","72",170]
[1178,"D20825029","CG","SL2V0 ニスクカラーＲＭ０１６ギングロ（Ｍ）",null,null,null,null,null,"0.60","72",170]
[1180,"D22603028","CG","SL4G0 チヨダストロングカラーＶ３　ＧＪＥ０８／９０２",null,null,null,null,null,"0.50","72",162]
[1181,"D22603029","CG","SL4G0 チヨダストロングカラーＶ３　ＧＪＥ０８／９０２",null,null,null,null,null,"0.50","72",198]
[1182,"D23407035","CG","SL4G0 チヨダストロングカラーＶ３　ＧＪＥ０８／９０２",null,null,null,null,null,"0.50","72",10]
[1183,"D23407036","CG","SL4G0 チヨダストロングカラーＶ３　ＧＪＥ０８／９０２",null,null,null,null,null,"0.50","72",32]
[1184,"D23407037","CG","SL4G0 チヨダストロングカラーＶ３　ＧＪＥ０８／９０２",null,null,null,null,null,"0.50","72",32]
[1185,"D21X20010","CG","SL4G0 チヨダストロングカラーＶ３　ＧＪＥ０８／９０２",null,null,null,null,null,"0.40","72",142]
[1186,"D21X20011","CG","SL4G0 チヨダストロングカラーＶ３　ＧＪＥ０８／９０２",null,null,null,null,null,"0.40","72",142]
[1187,"D21X20012","CG","SL4G0 チヨダストロングカラーＶ３　ＧＪＥ０８／９０２",null,null,null,null,null,"0.40","72",142]
[1188,"D21X20013","CG","SL4G0 チヨダストロングカラーＶ３　ＧＪＥ０８／９０２",null,null,null,null,null,"0.40","72",142]
[1189,"D21525330","CG","SL5T0 極みＭＡＸ　Ｋ０４５　ＫＮＣシルバーブラック（Ｍ",null,null,null,null,null,"0.60","72",175]
[1190,"D20316300","CG","SL5U0 極みＭＡＸ　Ｋ０５３　グレーシルバーＫＮＣ　（Ｍ",null,null,null,null,null,"0.40","72",128]
[1193,"D22X27011","CG","SLGGN GTNギングロ",null,null,null,null,null,"0.40","72",28]
[1194,"D23130005","CG","SLGGN GTNギングロ",null,null,null,null,null,"0.50","72",30]
[1195,"D23130006","CG","SLGGN GTNギングロ",null,null,null,null,null,"0.50","72",70]
[1197,"D22X27021","CG","SLSLN GTNシルバー",null,null,null,null,null,"0.40","72",34]
[1198,"D22X27022","CG","SLSLN GTNシルバー",null,null,null,null,null,"0.40","72",54]
[1199,"D22X27023","CG","SLSLN GTNシルバー",null,null,null,null,null,"0.40","72",54]
[1100,"D21X07021","FG","BKGL0 ＢＫＯ－５（黒）　ＦＫ２０１８／ＲＡ１４２３",null,null,null,null,null,"0.45","72",32]
[1117,"D21125023","FG","BW3P0 チヨダカラーＨＦ２０　ＧＨ１３２",null,null,null,null,null,"0.50","72",42]
[1118,"D21125024","FG","BW3P0 チヨダカラーＨＦ２０　ＧＨ１３２",null,null,null,null,null,"0.50","72",42]
[1119,"D21125025","FG","BW3P0 チヨダカラーＨＦ２０　ＧＨ１３２",null,null,null,null,null,"0.50","72",42]
[1120,"D21125026","FG","BW3P0 チヨダカラーＨＦ２０　ＧＨ１３２",null,null,null,null,null,"0.50","72",42]
[1121,"D21125027","FG","BW3P0 チヨダカラーＨＦ２０　ＧＨ１３２",null,null,null,null,null,"0.50","72",42]
[1122,"D21125028","FG","BW3P0 チヨダカラーＨＦ２０　ＧＨ１３２",null,null,null,null,null,"0.50","72",42]
[1128,"F20Y19056","FG","BWGL0 ＢＷＯ－１（茶）ＦＮ２０２５／ＲＡ１４２３",null,null,null,null,null,"0.45","72",74]
[1171,"D16Y17032","FG","GRGL0 ＧＲＯ－２（緑青）ＦＧ１３２１／ＲＡ１４２３",null,null,null,null,null,"0.45","72",62]
[1172,"D17807405","FG","GRGL0 ＧＲＯ－２（緑青）ＦＧ１３２１／ＲＡ１４２３",null,null,null,null,null,"0.45","72",75]
[1179,"D20608417","FG","SL3G0 チヨダカラーＨＦ２０　ＧＨ８０　（Ｍ）　ＧＨ８０",null,null,null,null,null,"0.50","72",46]
[1191,"D22215056","FG","SL7Y0 ヨドフロンYH203/YT1銀黒",null,null,null,null,null,"0.50","72",100]
[1192,"D22215057","FG","SL7Y0 ヨドフロンYH203/YT1銀黒",null,null,null,null,null,"0.50","72",167]
[1196,"D20Z30003","FG","SLS30 サンフロンＧＬＴＵＭ－０５（Ｍ）",null,null,null,null,null,"0.50","72",250]
[1381,"D23419001","CA","WTR50 A195　カーゴホワイト　UACJ",null,null,null,null,null,"0.70","762",1242]
[1382,"D23419002","CA","WTR50 A195　カーゴホワイト　UACJ",null,null,null,null,null,"0.70","762",1222]
[1383,"D23419003","CA","WTR50 A195　カーゴホワイト　UACJ",null,null,null,null,null,"0.70","762",1252]
[1384,"D23419004","CA","WTR50 A195　カーゴホワイト　UACJ",null,null,null,null,null,"0.70","762",1238]
[1200,"D23116006","CG","BKBKC GTNブラック(千代田GJE99)",null,null,null,null,null,"0.50","762",1805]
[1201,"D23116009","CG","BKBKC GTNブラック(千代田GJE99)",null,null,null,null,null,"0.50","762",1915]
[1202,"D23116010","CG","BKBKC GTNブラック(千代田GJE99)",null,null,null,null,null,"0.50","762",2378]
[1204,"D22420006","CG","BKW80 極みＭＡＸ　Ｋ０４３　ライトブラックＫＮＣ",null,null,null,null,null,"0.60","762",2210]
[1205,"D23113034","CG","BKX10 ストロングカラーＶ３　ＧＪＥ０１／９０２",null,null,null,null,null,"0.80","762",1256]
[1207,"D23526006","CG","BKZ00 ニスクカラーPro　GHK02ブラックパール",null,null,null,null,null,"0.80","762",2248]
[1208,"D22818018","CG","BLXS0 ストロングカラーＶ３　ＧＪＥ０７／９０２",null,null,null,null,null,"0.80","762",338]
[1209,"D23117017","CG","BLXS0 ストロングカラーＶ３　ＧＪＥ０７／９０２",null,null,null,null,null,"0.80","762",1388]
[1210,"D22727006","CG","BLXU0 極みＭＡＸ　Ｋ０１５マリンブルー",null,null,null,null,null,"0.80","762",1862]
[1212,"D22X17011","CG","BLYD0 ヨドＨｙｐｅｒＧＬカラー萠　ＫＳ５５Ｈ青",null,null,null,null,null,"0.80","762",998]
[1216,"D22X07026","CG","BWKCN GTNコゲチャ",null,null,null,null,null,"0.80","762",2243]
[1217,"D22419013","CG","CRC90 極みＭＡＸ　Ｋ００１　Ａミストホワイト",null,null,null,null,null,"0.80","762",1694]
[1218,"D23207001","CG","GLD80 チヨダストロングカラーⅤ３ＧＪＥ１３／９０２",null,null,null,null,null,"0.60","762",576]
[1224,"D22X18001","CG","GLVC0 ストロングカラーＶ３　ＧＪＥ３１／９０２",null,null,null,null,null,"0.80","762",1927]
[1225,"D22X18002","CG","GLVC0 ストロングカラーＶ３　ＧＪＥ３１／９０２",null,null,null,null,null,"0.80","762",1927]
[1226,"D22X18003","CG","GLVC0 ストロングカラーＶ３　ＧＪＥ３１／９０２",null,null,null,null,null,"0.80","762",1927]
[1227,"D22X18004","CG","GLVC0 ストロングカラーＶ３　ＧＪＥ３１／９０２",null,null,null,null,null,"0.80","762",1927]
[1228,"D22X18005","CG","GLVC0 ストロングカラーＶ３　ＧＪＥ３１／９０２",null,null,null,null,null,"0.80","762",1961]
[1229,"D22X18006","CG","GLVC0 ストロングカラーＶ３　ＧＪＥ３１／９０２",null,null,null,null,null,"0.80","762",1991]
[1230,"D22X18007","CG","GLVC0 ストロングカラーＶ３　ＧＪＥ３１／９０２",null,null,null,null,null,"0.80","762",1828]
[1231,"D22X18008","CG","GLVC0 ストロングカラーＶ３　ＧＪＥ３１／９０２",null,null,null,null,null,"0.80","762",1828]
[1232,"D22X18009","CG","GLVC0 ストロングカラーＶ３　ＧＪＥ３１／９０２",null,null,null,null,null,"0.80","762",1922]
[1233,"D22X18010","CG","GLVC0 ストロングカラーＶ３　ＧＪＥ３１／９０２",null,null,null,null,null,"0.80","762",1927]
[1234,"D22X18011","CG","GLVC0 ストロングカラーＶ３　ＧＪＥ３１／９０２",null,null,null,null,null,"0.80","762",1927]
[1235,"D22X18012","CG","GLVC0 ストロングカラーＶ３　ＧＪＥ３１／９０２",null,null,null,null,null,"0.80","762",1971]
[1236,"D22X19001","CG","GLVC0 ストロングカラーＶ３　ＧＪＥ３１／９０２",null,null,null,null,null,"0.80","762",1729]
[1237,"D22X19002","CG","GLVC0 ストロングカラーＶ３　ＧＪＥ３１／９０２",null,null,null,null,null,"0.80","762",1729]
[1238,"D22X19003","CG","GLVC0 ストロングカラーＶ３　ＧＪＥ３１／９０２",null,null,null,null,null,"0.80","762",1927]
[1239,"D22X19004","CG","GLVC0 ストロングカラーＶ３　ＧＪＥ３１／９０２",null,null,null,null,null,"0.80","762",1927]
[1240,"D22X19005","CG","GLVC0 ストロングカラーＶ３　ＧＪＥ３１／９０２",null,null,null,null,null,"0.80","762",1927]
[1241,"D22Z22001","CG","GLVC0 ストロングカラーＶ３　ＧＪＥ３１／９０２",null,null,null,null,null,"0.80","762",1877]
[1242,"D22Z22002","CG","GLVC0 ストロングカラーＶ３　ＧＪＥ３１／９０２",null,null,null,null,null,"0.80","762",2203]
[1243,"D22Z22003","CG","GLVC0 ストロングカラーＶ３　ＧＪＥ３１／９０２",null,null,null,null,null,"0.80","762",2322]
[1244,"D22Z22004","CG","GLVC0 ストロングカラーＶ３　ＧＪＥ３１／９０２",null,null,null,null,null,"0.80","762",2322]
[1245,"D22Z22005","CG","GLVC0 ストロングカラーＶ３　ＧＪＥ３１／９０２",null,null,null,null,null,"0.80","762",2322]
[1246,"D22Z26011","CG","GLVC0 ストロングカラーＶ３　ＧＪＥ３１／９０２",null,null,null,null,null,"0.80","762",1729]
[1247,"D22Z26012","CG","GLVC0 ストロングカラーＶ３　ＧＪＥ３１／９０２",null,null,null,null,null,"0.80","762",1729]
[1248,"D22Z26013","CG","GLVC0 ストロングカラーＶ３　ＧＪＥ３１／９０２",null,null,null,null,null,"0.80","762",1734]
[1249,"D22624013","CG","GLVC0 ストロングカラーＶ３　ＧＪＥ３１／９０２",null,null,null,null,null,"0.60","762",398]
[1250,"F22X07001","CG","GLVC0 ストロングカラーＶ３　ＧＪＥ３１／９０２",null,null,null,null,null,"0.60","762",1055]
[1251,"D22921031","CG","GLVP0 ニスクカラーProつやあり GCA20フリント",null,null,null,null,null,"0.80","762",207]
[1252,"F22909006","CG","GLVP0 ニスクカラーProつやあり GCA20フリント",null,null,null,null,null,"0.80","762",1970]
[1253,"D22616007","CG","GLVP0 ニスクカラーProつやあり GCA20フリント",null,null,null,null,null,"0.60","762",1926]
[1254,"D22907027","CG","GLVW0 ヨドHyperGLカラー萠　KS27H 墨",null,null,null,null,null,"0.60","762",804]
[1256,"D22419019","CG","GLVY0 ニスクカラーPro GCA19 グレー",null,null,null,null,null,"0.60","762",2147]
[1257,"D22419021","CG","GLVY0 ニスクカラーPro GCA19 グレー",null,null,null,null,null,"0.60","762",2315]
[1258,"D22419022","CG","GLVY0 ニスクカラーPro GCA19 グレー",null,null,null,null,null,"0.60","762",2315]
[1259,"D22419023","CG","GLVY0 ニスクカラーPro GCA19 グレー",null,null,null,null,null,"0.60","762",2315]
[1260,"D22419024","CG","GLVY0 ニスクカラーPro GCA19 グレー",null,null,null,null,null,"0.60","762",2315]
[1261,"D22419025","CG","GLVY0 ニスクカラーPro GCA19 グレー",null,null,null,null,null,"0.60","762",2263]
[1262,"D22722005","CG","GLZU0 極みＭＡＸ　Ｋ００７ナチュラルグレーＫＮＣ",null,null,null,null,null,"0.80","762",2860]
[1263,"D22722007","CG","GLZU0 極みＭＡＸ　Ｋ００７ナチュラルグレーＫＮＣ",null,null,null,null,null,"0.80","762",2435]
[1264,"D22722008","CG","GLZU0 極みＭＡＸ　Ｋ００７ナチュラルグレーＫＮＣ",null,null,null,null,null,"0.80","762",2440]
[1265,"D22722009","CG","GLZU0 極みＭＡＸ　Ｋ００７ナチュラルグレーＫＮＣ",null,null,null,null,null,"0.80","762",2445]
[1266,"D22722011","CG","GLZU0 極みＭＡＸ　Ｋ００７ナチュラルグレーＫＮＣ",null,null,null,null,null,"0.80","762",2534]
[1267,"D22722014","CG","GLZU0 極みＭＡＸ　Ｋ００７ナチュラルグレーＫＮＣ",null,null,null,null,null,"0.80","762",2638]
[1268,"D22722018","CG","GLZU0 極みＭＡＸ　Ｋ００７ナチュラルグレーＫＮＣ",null,null,null,null,null,"0.80","762",2144]
[1269,"D22722024","CG","GLZU0 極みＭＡＸ　Ｋ００７ナチュラルグレーＫＮＣ",null,null,null,null,null,"0.80","762",2737]
[1270,"D22722025","CG","GLZU0 極みＭＡＸ　Ｋ００７ナチュラルグレーＫＮＣ",null,null,null,null,null,"0.80","762",2737]
[1271,"D21Y05045","CG","GR5D0 サンライトＧＬＲＧ８５　ＯＲＧ８５／ＯＲＧ",null,null,null,null,null,"0.80","762",1164]
[1272,"D22906014","CG","GRTZ0 チヨダストロングカラーＶ３　ＧＪＥ１１",null,null,null,null,null,"0.80","762",1724]
[1273,"D22Z16051","CG","GRTZ0 チヨダストロングカラーＶ３　ＧＪＥ１１",null,null,null,null,null,"0.80","762",588]
[1274,"F22916009","CG","GRTZ0 チヨダストロングカラーＶ３　ＧＪＥ１１",null,null,null,null,null,"0.80","762",924]
[1275,"D22X06023","CG","RDC60 ストロングカラーＶ３　ＧＪＥ１２／９０２",null,null,null,null,null,"0.80","762",485]
[1344,"D22Z14001","CG","SL4G0 チヨダストロングカラーＶ３　ＧＪＥ０８／９０２",null,null,null,null,null,"0.80","762",1006]
[1345,"D23130043","CG","SL4G0 チヨダストロングカラーＶ３　ＧＪＥ０８／９０２",null,null,null,null,null,"0.80","762",2317]
[1346,"D23201002","CG","SL4G0 チヨダストロングカラーＶ３　ＧＪＥ０８／９０２",null,null,null,null,null,"0.80","762",1760]
[1348,"A22523111","CG","SL4N0 ヨドＧＬカラー萌ＫＳ１５／ＹＧ０１メトロシルバ－",null,null,null,null,null,"0.80","762",266]
[1349,"D21518008","CG","SL5T0 極みＭＡＸ　Ｋ０４５　ＫＮＣシルバーブラック（Ｍ",null,null,null,null,null,"0.80","762",952]
[1350,"D22Z23024","CG","SL5U0 極みＭＡＸ　Ｋ０５３　グレーシルバーＫＮＣ　（Ｍ",null,null,null,null,null,"0.80","762",2652]
[1351,"D23426001","CG","SL5U0 極みＭＡＸ　Ｋ０５３　グレーシルバーＫＮＣ　（Ｍ",null,null,null,null,null,"0.80","762",2584]
[1352,"D23426002","CG","SL5U0 極みＭＡＸ　Ｋ０５３　グレーシルバーＫＮＣ　（Ｍ",null,null,null,null,null,"0.80","762",2589]
[1353,"D23426003","CG","SL5U0 極みＭＡＸ　Ｋ０５３　グレーシルバーＫＮＣ　（Ｍ",null,null,null,null,null,"0.80","762",2761]
[1354,"D22928024","CG","SL6A0 チヨダカラーＧＬ　輝き　ＳＨシルバー　ＧＥＲ８１",null,null,null,null,null,"0.80","762",668]
[1355,"A21Y29007","CG","SL6S0 SERIOS PRIME S81Vシルバー(M)",null,null,null,null,null,"0.80","762",366]
[1356,"D21Z17006","CG","SL6S0 SERIOS PRIME S81Vシルバー(M)",null,null,null,null,null,"0.80","762",2053]
[1357,"D23220001","CG","SL7B0 チヨダストロングＶ３　ＧＱＶ８０／９０２　（Ｍ）",null,null,null,null,null,"0.60","762",1294]
[1358,"D22112027","CG","SL7B0 チヨダストロングＶ３　ＧＱＶ８０／９０２　（Ｍ）",null,null,null,null,null,"0.80","762",1084]
[1359,"D22607004","CG","SL7B0 チヨダストロングＶ３　ＧＱＶ８０／９０２　（Ｍ）",null,null,null,null,null,"0.80","762",1284]
[1360,"D22726004","CG","SL7B0 チヨダストロングＶ３　ＧＱＶ８０／９０２　（Ｍ）",null,null,null,null,null,"0.80","762",1758]
[1361,"D22Y16005","CG","SL7B0 チヨダストロングＶ３　ＧＱＶ８０／９０２　（Ｍ）",null,null,null,null,null,"0.80","762",1276]
[1362,"D20605008","CG","SL7G0 ニスクカラーＰＲＯ　ＧＣＭ３７　マットシルバー",null,null,null,null,null,"0.60","762",996]
[1363,"D21924021","CG","SL8B0 ヨドHyper GLカラーGS25Hシルバー(M",null,null,null,null,null,"0.60","762",1588]
[1365,"D23224006","CG","SLGGN GTNギングロ",null,null,null,null,null,"0.80","762",2233]
[1366,"D21111004","CG","SLJ80 サンライトGLRM81（M）（ORM81/OGR",null,null,null,null,null,"0.60","762",2057]
[1367,"D21111005","CG","SLJ80 サンライトGLRM81（M）（ORM81/OGR",null,null,null,null,null,"0.60","762",1638]
[1368,"D21111001","CG","SLJ80 サンライトGLRM81（M）（ORM81/OGR",null,null,null,null,null,"0.80","762",2302]
[1369,"D21111002","CG","SLJ80 サンライトGLRM81（M）（ORM81/OGR",null,null,null,null,null,"0.80","762",2371]
[1370,"D21222003","CG","SLJ80 サンライトGLRM81（M）（ORM81/OGR",null,null,null,null,null,"0.80","762",636]
[1371,"F22823007","CG","SLSLN GTNシルバー",null,null,null,null,null,"0.60","762",284]
[1372,"D23411001","CG","SLSLN GTNシルバー",null,null,null,null,null,"0.80","762",2465]
[1373,"D23411002","CG","SLSLN GTNシルバー",null,null,null,null,null,"0.80","762",2354]
[1374,"D21301019","CG","TWC40 チヨダカラーNEXT GE760/G840",null,null,null,null,null,"0.80","762",1532]
[1375,"D23216030","CG","TWD80 GJE32/GJE32",null,null,null,null,null,"0.80","762",968]
[1376,"D22X08005","CG","WTM40 極みＭＡＸ　Ｋ００５　ＡマットホワイトＫＮＣ",null,null,null,null,null,"0.60","762",940]
[1377,"D21Z21019","CG","WTM50 ニスクカラーＳＧＬ　ＲＷ００７Ｓ",null,null,null,null,null,"0.60","762",518]
[1378,"A22704020","CG","WTM60 Ｊクラフト　和みＦＩＴ　Ｂ０２Ｗしろいろ",null,null,null,null,null,"0.80","762",1166]
[1379,"D22909015","CG","WTP60 ニスクカラーＰＲＯ　つやありＧＣＷ０７",null,null,null,null,null,"0.60","762",820]
[1380,"D23306006","CG","WTR10 チヨダカラー　LX　GTX700（ホワイト",null,null,null,null,null,"0.60","762",754]
[1219,"D23116017","CS","GLG30 ＧＬＯ－３（グレー）ＣＳ",null,null,null,null,null,"0.80","762",1530]
[1203,"D20X20007","FG","BKW40 ニスクフロンＳＧＬ　ＦＫ２００Ｓ",null,null,null,null,null,"0.80","762",1168]
[1220,"D20X12001","FG","GLGL0 ＧＬＯ－３（グレー）ＦＡ１４５７／ＲＡ１４２３",null,null,null,null,null,"0.80","762",1460]
[1221,"D20Y06040","FG","GLGL0 ＧＬＯ－３（グレー）ＦＡ１４５７／ＲＡ１４２３",null,null,null,null,null,"0.80","762",690]
[1222,"D23411033","FG","GLJ10 チヨダカラーＨＦ２０　ＧＨ７４１",null,null,null,null,null,"0.80","762",2174]
[1223,"F20925025","FG","GLJ10 チヨダカラーＨＦ２０　ＧＨ７４１",null,null,null,null,null,"0.80","762",863]
[1255,"D22Z21001","FG","GLVX0 ヨドHyperGLカラータフロンYT25Hグレー",null,null,null,null,null,"0.80","762",760]
[1343,"D21820092","FG","SL2N0 チヨダカラーＨＦ２０　ＧＨ７６９／９０２（Ｍ）",null,null,null,null,null,"0.80","762",1696]
[1347,"F21X04033","FG","SL4M0 ニスクフロンＳＧＬ　ＦＭ１０８Ｓ（Ｍ）",null,null,null,null,null,"0.80","762",1318]
[1206,"D23316301","LS","BKY80 BKO-5 (443CT)",null,null,null,null,null,"0.80","762",220]
[1276,"D22210046","NG","SG580 ガルバリウム素地（ＪＦＥ）ＡＺ１５０",null,null,null,null,null,"0.60","762",2790]
[1277,"D22210047","NG","SG580 ガルバリウム素地（ＪＦＥ）ＡＺ１５０",null,null,null,null,null,"0.60","762",2790]
[1278,"D22210048","NG","SG580 ガルバリウム素地（ＪＦＥ）ＡＺ１５０",null,null,null,null,null,"0.60","762",2790]
[1279,"D22328023","NG","SG580 ガルバリウム素地（ＪＦＥ）ＡＺ１５０",null,null,null,null,null,"0.60","762",2985]
[1280,"D22727007","NG","SG580 ガルバリウム素地（ＪＦＥ）ＡＺ１５０",null,null,null,null,null,"0.60","762",2472]
[1281,"D22727008","NG","SG580 ガルバリウム素地（ＪＦＥ）ＡＺ１５０",null,null,null,null,null,"0.60","762",2712]
[1282,"D22727009","NG","SG580 ガルバリウム素地（ＪＦＥ）ＡＺ１５０",null,null,null,null,null,"0.60","762",2165]
[1283,"D22727010","NG","SG580 ガルバリウム素地（ＪＦＥ）ＡＺ１５０",null,null,null,null,null,"0.60","762",2431]
[1284,"D22727011","NG","SG580 ガルバリウム素地（ＪＦＥ）ＡＺ１５０",null,null,null,null,null,"0.60","762",2506]
[1285,"D22727012","NG","SG580 ガルバリウム素地（ＪＦＥ）ＡＺ１５０",null,null,null,null,null,"0.60","762",2139]
[1286,"D22Y18034","NG","SG580 ガルバリウム素地（ＪＦＥ）ＡＺ１５０",null,null,null,null,null,"0.60","762",1530]
[1287,"D23118020","NG","SG580 ガルバリウム素地（ＪＦＥ）ＡＺ１５０",null,null,null,null,null,"0.60","762",2783]
[1288,"D23118026","NG","SG580 ガルバリウム素地（ＪＦＥ）ＡＺ１５０",null,null,null,null,null,"0.60","762",380]
[1289,"D21510018","NG","SG580 ガルバリウム素地（ＪＦＥ）ＡＺ１５０",null,null,null,null,null,"0.80","762",2623]
[1290,"D21X18001","NG","SG580 ガルバリウム素地（ＪＦＥ）ＡＺ１５０",null,null,null,null,null,"0.80","762",2475]
[1291,"D21Z23008","NG","SG580 ガルバリウム素地（ＪＦＥ）ＡＺ１５０",null,null,null,null,null,"0.80","762",2277]
[1292,"D22328011","NG","SG580 ガルバリウム素地（ＪＦＥ）ＡＺ１５０",null,null,null,null,null,"0.80","762",2984]
[1293,"D22328012","NG","SG580 ガルバリウム素地（ＪＦＥ）ＡＺ１５０",null,null,null,null,null,"0.80","762",1744]
[1294,"D22328013","NG","SG580 ガルバリウム素地（ＪＦＥ）ＡＺ１５０",null,null,null,null,null,"0.80","762",1754]
[1295,"D22328014","NG","SG580 ガルバリウム素地（ＪＦＥ）ＡＺ１５０",null,null,null,null,null,"0.80","762",2999]
[1296,"D22328015","NG","SG580 ガルバリウム素地（ＪＦＥ）ＡＺ１５０",null,null,null,null,null,"0.80","762",2396]
[1297,"D22328016","NG","SG580 ガルバリウム素地（ＪＦＥ）ＡＺ１５０",null,null,null,null,null,"0.80","762",2697]
[1298,"D22824129","NG","SG580 ガルバリウム素地（ＪＦＥ）ＡＺ１５０",null,null,null,null,null,"0.80","762",2707]
[1299,"D22825033","NG","SG580 ガルバリウム素地（ＪＦＥ）ＡＺ１５０",null,null,null,null,null,"0.80","762",756]
[1300,"D22Z21004","NG","SG580 ガルバリウム素地（ＪＦＥ）ＡＺ１５０",null,null,null,null,null,"0.80","762",2202]
[1301,"D22Z21005","NG","SG580 ガルバリウム素地（ＪＦＥ）ＡＺ１５０",null,null,null,null,null,"0.80","762",2915]
[1302,"D22Z21006","NG","SG580 ガルバリウム素地（ＪＦＥ）ＡＺ１５０",null,null,null,null,null,"0.80","762",2915]
[1303,"D22Z21007","NG","SG580 ガルバリウム素地（ＪＦＥ）ＡＺ１５０",null,null,null,null,null,"0.80","762",2915]
[1304,"D22Z21008","NG","SG580 ガルバリウム素地（ＪＦＥ）ＡＺ１５０",null,null,null,null,null,"0.80","762",2915]
[1305,"D22510042","NG","SG900 ガルバリウム素地（日鉄鋼板）ＡＺ１５０",null,null,null,null,null,"0.80","762",1882]
[1306,"D22607006","NG","SG900 ガルバリウム素地（日鉄鋼板）ＡＺ１５０",null,null,null,null,null,"0.80","762",154]
[1307,"D22818040","NG","SG900 ガルバリウム素地（日鉄鋼板）ＡＺ１５０",null,null,null,null,null,"0.80","762",2337]
[1308,"D22818045","NG","SG900 ガルバリウム素地（日鉄鋼板）ＡＺ１５０",null,null,null,null,null,"0.80","762",2292]
[1309,"D22818054","NG","SG900 ガルバリウム素地（日鉄鋼板）ＡＺ１５０",null,null,null,null,null,"0.80","762",2292]
[1310,"D23525012","NG","SG900 ガルバリウム素地（日鉄鋼板）ＡＺ１５０",null,null,null,null,null,"0.80","762",2692]
[1311,"D23526005","NG","SG900 ガルバリウム素地（日鉄鋼板）ＡＺ１５０",null,null,null,null,null,"0.80","762",2677]
[1312,"F21402005","NG","SG900 ガルバリウム素地（日鉄鋼板）ＡＺ１５０",null,null,null,null,null,"0.80","762",715]
[1313,"D22901035","NG","SG990 ガルバリウム素地（日鉄鋼板市川）",null,null,null,null,null,"1.20","762",2228]
[1314,"D22901036","NG","SG990 ガルバリウム素地（日鉄鋼板市川）",null,null,null,null,null,"1.20","762",1737]
[1315,"D21419001","NG","SGB60 ガルバリウム素地（淀）",null,null,null,null,null,"0.60","762",1361]
[1316,"D22526014","NG","SGB60 ガルバリウム素地（淀）",null,null,null,null,null,"0.60","762",2764]
[1317,"D22526015","NG","SGB60 ガルバリウム素地（淀）",null,null,null,null,null,"0.60","762",2809]
[1318,"D22526016","NG","SGB60 ガルバリウム素地（淀）",null,null,null,null,null,"0.60","762",2809]
[1319,"D22526017","NG","SGB60 ガルバリウム素地（淀）",null,null,null,null,null,"0.60","762",2824]
[1320,"D22526018","NG","SGB60 ガルバリウム素地（淀）",null,null,null,null,null,"0.60","762",2812]
[1321,"D23112003","NG","SGB60 ガルバリウム素地（淀）",null,null,null,null,null,"0.60","762",2798]
[1322,"D23112004","NG","SGB60 ガルバリウム素地（淀）",null,null,null,null,null,"0.60","762",922]
[1323,"D22325026","NG","SGB60 ガルバリウム素地（淀）",null,null,null,null,null,"0.80","762",2979]
[1324,"D22325027","NG","SGB60 ガルバリウム素地（淀）",null,null,null,null,null,"0.80","762",2979]
[1325,"D22325028","NG","SGB60 ガルバリウム素地（淀）",null,null,null,null,null,"0.80","762",2979]
[1326,"D22404076","NG","SGB60 ガルバリウム素地（淀）",null,null,null,null,null,"0.80","762",798]
[1327,"A23131006","NG","SGC30 ＧＬ素地（東国製鋼）",null,null,null,null,null,"0.60","762",1354]
[1328,"A23131007","NG","SGC30 ＧＬ素地（東国製鋼）",null,null,null,null,null,"0.60","762",2831]
[1329,"A23131008","NG","SGC30 ＧＬ素地（東国製鋼）",null,null,null,null,null,"0.60","762",2827]
[1330,"D22210014","NG","SGC30 ＧＬ素地（東国製鋼）",null,null,null,null,null,"0.60","762",1536]
[1331,"D23105001","NG","SGC30 ＧＬ素地（東国製鋼）",null,null,null,null,null,"0.60","762",1230]
[1332,"D23105002","NG","SGC30 ＧＬ素地（東国製鋼）",null,null,null,null,null,"0.60","762",1110]
[1333,"D23105003","NG","SGC30 ＧＬ素地（東国製鋼）",null,null,null,null,null,"0.60","762",1110]
[1334,"D23105004","NG","SGC30 ＧＬ素地（東国製鋼）",null,null,null,null,null,"0.60","762",1240]
[1335,"D23105005","NG","SGC30 ＧＬ素地（東国製鋼）",null,null,null,null,null,"0.60","762",302]
[1336,"D23105006","NG","SGC30 ＧＬ素地（東国製鋼）",null,null,null,null,null,"0.60","762",1230]
[1337,"D23105007","NG","SGC30 ＧＬ素地（東国製鋼）",null,null,null,null,null,"0.60","762",1220]
[1338,"D23105008","NG","SGC30 ＧＬ素地（東国製鋼）",null,null,null,null,null,"0.60","762",1120]
[1339,"F22Y29028","NG","SGC30 ＧＬ素地（東国製鋼）",null,null,null,null,null,"0.60","762",1830]
[1340,"A22Y16024","NG","SGD00 ＧＬ素地（丸一鋼管）ＡＺ１５０",null,null,null,null,null,"0.60","762",250]
[1341,"F22517004","NG","SGD00 ＧＬ素地（丸一鋼管）ＡＺ１５０",null,null,null,null,null,"1.20","762",822]
[1342,"D22422005","NG","SGE70 エスジーエル素地",null,null,null,null,null,"0.80","762",440]
[1211,"D21Y26026","UF","BLXY0 スーパーガードＧＬつよしＧＸ４２",null,null,null,null,null,"0.80","762",1966]
[1213,"D22719001","UF","BLYK0 ハイレタンSGL UZ330Sダークブルー",null,null,null,null,null,"0.80","762",1892]
[1214,"D22719005","UF","BLYK0 ハイレタンSGL UZ330Sダークブルー",null,null,null,null,null,"0.80","762",538]
[1215,"D22719007","UF","BLYK0 ハイレタンSGL UZ330Sダークブルー",null,null,null,null,null,"0.80","762",1380]
[1364,"D23421002","UF","SL8G0 ハイレタンSGL UZ532Sシルバーブラウン",null,null,null,null,null,"0.80","762",1025]
[1385,"D22217027","FG","BWGL0 ＢＷＯ－１（茶）ＦＮ２０２５／ＲＡ１４２３",null,null,null,null,null,"0.45","77",28]
[1464,"A21701004","CE","OT020 色調区分なき塩ビ鋼板",null,null,null,null,null,"0.35","914",525]
[1389,"A21311002","CG","BKK50 サンライトＧＬＲＮ８３ＲＮ２０６３（ＥＲＮ８３／",null,null,null,null,null,"0.80","914",603]
[1390,"D22Y04039","CG","BKT20 チヨダカラーＧＬＧＥＲ１０／９０２　ＳＨブラック",null,null,null,null,null,"0.80","914",1504]
[1392,"D21X12001","CG","BKX00 極みＭＡＸ　Ｋ０４１　ジェットブラックＫＮＣ",null,null,null,null,null,"0.50","914",90]
[1393,"D23113046","CG","BKX10 ストロングカラーＶ３　ＧＪＥ０１／９０２",null,null,null,null,null,"0.60","914",89]
[1396,"D22622027","CG","BKZ00 ニスクカラーPro　GHK02ブラックパール",null,null,null,null,null,"0.50","914",261]
[1399,"D23117022","CG","BLXS0 ストロングカラーＶ３　ＧＪＥ０７／９０２",null,null,null,null,null,"0.50","914",1951]
[1400,"D22523013","CG","BLXU0 極みＭＡＸ　Ｋ０１５マリンブルー",null,null,null,null,null,"0.50","914",159]
[1402,"D23213009","CG","BLYC0 ニスクカラーＰＲＯ　ＧＣＢ０９ブルー",null,null,null,null,null,"0.80","914",1172]
[1403,"D22907028","CG","BLYD0 ヨドＨｙｐｅｒＧＬカラー萠　ＫＳ５５Ｈ青",null,null,null,null,null,"0.50","914",238]
[1404,"D23130046","CG","BLYD0 ヨドＨｙｐｅｒＧＬカラー萠　ＫＳ５５Ｈ青",null,null,null,null,null,"0.50","914",83]
[1405,"D22928019","CG","BLYL0 チヨダカラーLXつやあり　GLX510　ブルー",null,null,null,null,null,"0.50","914",1662]
[1406,"D21X19017","CG","BW3T0 ニスクカラーつやけしＲＮ０２３",null,null,null,null,null,"0.50","914",2002]
[1407,"F20108013","CG","BWE90 ニスクカラーＳＧＬ　ＲＭ０２１Ｓ（Ｍ）",null,null,null,null,null,"0.80","914",1512]
[1409,"D22Y01022","CG","BWKCN GTNコゲチャ",null,null,null,null,null,"0.35","914",14]
[1410,"D22607001","CG","CRA70 チヨダカラーＧＬ　Ｇ２３１",null,null,null,null,null,"0.50","914",2126]
[1411,"A19905008","CG","CRB20 ニスクカラー　ＲＶ０１５クリーム",null,null,null,null,null,"0.50","914",659]
[1412,"D22420001","CG","CRC90 極みＭＡＸ　Ｋ００１　Ａミストホワイト",null,null,null,null,null,"0.80","914",1733]
[1413,"D22325029","CG","CRD80 ＪＦＥ　和みＦＩＴ　ＡこむぎいろＮＣ　Ｂ１０Ｗ",null,null,null,null,null,"0.50","914",192]
[1414,"A22525049","CG","GLD80 チヨダストロングカラーⅤ３ＧＪＥ１３／９０２",null,null,null,null,null,"0.50","914",775]
[1415,"D19610018","CG","GLD80 チヨダストロングカラーⅤ３ＧＪＥ１３／９０２",null,null,null,null,null,"0.35","914",2268]
[1418,"D20Y30045","CG","GLJ70 チヨダカラーＧ８４０",null,null,null,null,null,"0.50","914",485]
[1419,"F21908005","CG","GLK00 ニスクカラーＧＬ　RA019Sグレー",null,null,null,null,null,"0.80","914",353]
[1420,"F19821401","CG","GLK70 チヨダストロングカラーＮＥＸＴ　ＧＥ０８　（Ｍ）",null,null,null,null,null,"0.50","914",151]
[1421,"D22526020","CG","GLM00 ニスクカラーＲＡ０２０　フリントグレー",null,null,null,null,null,"0.50","914",212]
[1422,"D21316004","CG","GLU90 サンライトＧＬＲＭ８０（Ｍ）　ＯＲＭ８０／ＯＧＲ",null,null,null,null,null,"0.50","914",1282]
[1423,"D22413010","CG","GLU90 サンライトＧＬＲＭ８０（Ｍ）　ＯＲＭ８０／ＯＧＲ",null,null,null,null,null,"0.50","914",1490]
[1424,"D21316003","CG","GLU90 サンライトＧＬＲＭ８０（Ｍ）　ＯＲＭ８０／ＯＧＲ",null,null,null,null,null,"0.60","914",615]
[1425,"D21608005","CG","GLU90 サンライトＧＬＲＭ８０（Ｍ）　ＯＲＭ８０／ＯＧＲ",null,null,null,null,null,"0.60","914",265]
[1426,"D22413009","CG","GLU90 サンライトＧＬＲＭ８０（Ｍ）　ＯＲＭ８０／ＯＧＲ",null,null,null,null,null,"0.60","914",557]
[1427,"D23522030","CG","GLVC0 ストロングカラーＶ３　ＧＪＥ３１／９０２",null,null,null,null,null,"0.50","914",196]
[1428,"D22X19006","CG","GLVC0 ストロングカラーＶ３　ＧＪＥ３１／９０２",null,null,null,null,null,"0.80","914",1853]
[1429,"D23110007","CG","GLVJ0 ニスクカラーPRO GCA51 Sマットグレー",null,null,null,null,null,"0.60","914",640]
[1430,"D23508003","CG","GLVJ0 ニスクカラーPRO GCA51 Sマットグレー",null,null,null,null,null,"0.60","914",606]
[1431,"F22Y17001","CG","GLVP0 ニスクカラーProつやあり GCA20フリント",null,null,null,null,null,"0.50","914",286]
[1432,"D22921035","CG","GLVP0 ニスクカラーProつやあり GCA20フリント",null,null,null,null,null,"0.60","914",660]
[1433,"D22X21020","CG","GLVP0 ニスクカラーProつやあり GCA20フリント",null,null,null,null,null,"0.80","914",171]
[1434,"D21706052","CG","GLVV0 ヨドHyperGLカラーU450SEスキムグレー",null,null,null,null,null,"0.50","914",286]
[1436,"D23224007","CG","GLWB0 チヨダカラーLX GLX730グレー",null,null,null,null,null,"0.50","914",1272]
[1437,"D23322001","CG","GLWB0 チヨダカラーLX GLX730グレー",null,null,null,null,null,"0.50","914",2111]
[1438,"A22719023","CG","GLZG0 チヨダカラーＧＬ輝きＧＥＲ８０　ＳＨグレー",null,null,null,null,null,"0.50","914",300]
[1439,"D22808003","CG","GLZU0 極みＭＡＸ　Ｋ００７ナチュラルグレーＫＮＣ",null,null,null,null,null,"0.50","914",742]
[1441,"D23227004","CG","GRMGN GTNモスグリーン",null,null,null,null,null,"0.50","914",1581]
[1442,"D23426007","CG","GRRYN GTNロクショウ",null,null,null,null,null,"0.50","914",2300]
[1443,"D22901037","CG","GRRYN GTNロクショウ",null,null,null,null,null,"0.60","914",155]
[1444,"D22Z02016","CG","GRRYN GTNロクショウ",null,null,null,null,null,"0.60","914",2600]
[1445,"D23426006","CG","GRRYN GTNロクショウ",null,null,null,null,null,"0.80","914",1918]
[1449,"A19412003","CG","GRTE0 ニスクカラーＧＬ　ＲＧ００４",null,null,null,null,null,"0.50","914",212]
[1450,"A22609001","CG","GRTZ0 チヨダストロングカラーＶ３　ＧＪＥ１１",null,null,null,null,null,"0.50","914",165]
[1451,"D22Z01010","CG","GRTZ0 チヨダストロングカラーＶ３　ＧＪＥ１１",null,null,null,null,null,"0.60","914",1064]
[1452,"D22825028","CG","GRUC0 ストロングカラーＶ３　ＧＪＥ０２　モスグリーン",null,null,null,null,null,"0.60","914",1170]
[1453,"D23307010","CG","GRUC0 ストロングカラーＶ３　ＧＪＥ０２　モスグリーン",null,null,null,null,null,"0.50","914",654]
[1454,"D22916042","CG","GRV60 ヨドＨＹＰＥＲ　ＧＬカラー萠ＫＳ７７Ｈ緑青",null,null,null,null,null,"0.80","914",2250]
[1455,"D20622010","CG","GRV70 ストロングカラーＶ３　ＧＪＥ３７／９０２",null,null,null,null,null,"0.50","914",712]
[1459,"D21304033","CG","GRVE0 ニスクカラーＳＧＬ　ＲＧ００４Ｓ　モスグリーン",null,null,null,null,null,"0.50","914",478]
[1460,"D21304029","CG","GRVP0 ニスクカラーＳＧＬ　ＲＧ００５Ｓ　リョクショウ",null,null,null,null,null,"0.50","914",250]
[1461,"D21304037","CG","GRW10 ﾆｽｸｶﾗｰSGLつやあり:RG003S　Sグリ",null,null,null,null,null,"0.50","914",1003]
[1462,"A21Z09012","CG","GRX20 ニスクカラーPro Cミントグリーン　GCG15",null,null,null,null,null,"0.50","914",757]
[1463,"D22706010","CG","GRX50 ニスクカラーPro GCG06Ｓウグイス",null,null,null,null,null,"0.50","914",1791]
[1465,"D22Y04034","CG","RDD80 ニスクカラーＳＧＬ　ＲＲ０２４Ｓダークレッド",null,null,null,null,null,"0.50","914",944]
[1466,"D20720044","CG","RDE40 チヨダカラーＧＬ　輝き　ＳＨレンガ　ＧＥＲ９０",null,null,null,null,null,"0.50","914",281]
[1467,"A22624019","CG","RDP50 ニスクカラーＰＲＯ　ＧＨＲ３８　ブリックレッド",null,null,null,null,null,"0.50","914",620]
[1468,"D22Y25034","CG","RDRBN GTNレッドブラウン",null,null,null,null,null,"0.40","914",1285]
[1488,"D20Y24029","CG","SL4G0 チヨダストロングカラーＶ３　ＧＪＥ０８／９０２",null,null,null,null,null,"0.60","914",152]
[1489,"D22613013","CG","SL4G0 チヨダストロングカラーＶ３　ＧＪＥ０８／９０２",null,null,null,null,null,"0.60","914",1030]
[1490,"F23322026","CG","SL4G0 チヨダストロングカラーＶ３　ＧＪＥ０８／９０２",null,null,null,null,null,"0.80","914",1364]
[1491,"A22722022","CG","SL4T0 ニスクカラーＳＧＬ　ＲＭ０１６Ｓ　ギングロ",null,null,null,null,null,"0.40","914",218]
[1492,"F22727013","CG","SL4T0 ニスクカラーＳＧＬ　ＲＭ０１６Ｓ　ギングロ",null,null,null,null,null,"0.40","914",942]
[1496,"D23118018","CG","SL5U0 極みＭＡＸ　Ｋ０５３　グレーシルバーＫＮＣ　（Ｍ",null,null,null,null,null,"0.50","914",1064]
[1497,"D23309003","CG","SL5Y0 Ｊクラフト和み　Ｕ７６Ｗ　しろがねいろ（Ｍ）",null,null,null,null,null,"0.50","914",248]
[1498,"D20826042","CG","SL6A0 チヨダカラーＧＬ　輝き　ＳＨシルバー　ＧＥＲ８１",null,null,null,null,null,"0.50","914",160]
[1499,"D23220008","CG","SL7B0 チヨダストロングＶ３　ＧＱＶ８０／９０２　（Ｍ）",null,null,null,null,null,"0.50","914",1572]
[1500,"D21Z17025","CG","SL7F0 ニスクカラーＰＲＯ　ＧＣＭ１７　シルバー",null,null,null,null,null,"0.50","914",144]
[1501,"D21Z24028","CG","SL7F0 ニスクカラーＰＲＯ　ＧＣＭ１７　シルバー",null,null,null,null,null,"0.80","914",890]
[1502,"D22X12023","CG","SL7M0 ニスクカラーＰＲＯ　ＧＣＭ１６　いぶし銀",null,null,null,null,null,"0.60","914",141]
[1503,"D22111024","CG","SL7M0 ニスクカラーＰＲＯ　ＧＣＭ１６　いぶし銀",null,null,null,null,null,"0.50","914",1310]
[1504,"D22119020","CG","SL7M0 ニスクカラーＰＲＯ　ＧＣＭ１６　いぶし銀",null,null,null,null,null,"0.50","914",2192]
[1505,"F22510001","CG","SL7M0 ニスクカラーＰＲＯ　ＧＣＭ１６　いぶし銀",null,null,null,null,null,"0.40","914",668]
[1506,"D22X07049","CG","SL7R0 ヨドhyper GLカラー萠KS95H 銀黒",null,null,null,null,null,"0.50","914",250]
[1507,"D22Z14013","CG","SL7R0 ヨドhyper GLカラー萠KS95H 銀黒",null,null,null,null,null,"0.40","914",167]
[1508,"D22902004","CG","SL7R0 ヨドhyper GLカラー萠KS95H 銀黒",null,null,null,null,null,"0.80","914",1344]
[1509,"D21824058","CG","SL7S0 ニスクカラーpro GCM36ペールゴールド",null,null,null,null,null,"0.35","914",81]
[1511,"F22922007","CG","SL8D0 チヨダカラーLXつや有　GLX760シルバー",null,null,null,null,null,"0.50","914",1361]
[1513,"D22Z23025","CG","SLGGN GTNギングロ",null,null,null,null,null,"0.80","914",1910]
[1514,"D23224005","CG","SLGGN GTNギングロ",null,null,null,null,null,"0.80","914",847]
[1515,"D23526003","CG","SLGGN GTNギングロ",null,null,null,null,null,"0.80","914",2315]
[1516,"D22X07029","CG","SLGGN GTNギングロ",null,null,null,null,null,"0.60","914",985]
[1517,"D23130029","CG","SLGGN GTNギングロ",null,null,null,null,null,"0.60","914",1217]
[1518,"D23328001","CG","SLGGN GTNギングロ",null,null,null,null,null,"0.50","914",603]
[1519,"F21714001","CG","SLJ80 サンライトGLRM81（M）（ORM81/OGR",null,null,null,null,null,"0.80","914",553]
[1520,"D21824032","CG","SLJ80 サンライトGLRM81（M）（ORM81/OGR",null,null,null,null,null,"0.50","914",290]
[1521,"F22Z26011","CG","SLSLN GTNシルバー",null,null,null,null,null,"0.50","914",212]
[1522,"D22725016","CG","TC020 ニスクカラー　ＯＴＥ００２　テラコッタ",null,null,null,null,null,"0.40","914",460]
[1523,"A22823002","CG","TW6J0 チヨダカラー輝きＧＥＲ１０／ＧＥＲ８２",null,null,null,null,null,"0.80","914",2060]
[1524,"A20X06022","CG","TWA30 ストロングＶ３　ＧＱＶ８０／ＧＱＶ８０",null,null,null,null,null,"0.50","914",1171]
[1526,"D22Y04036","CG","TWD20 チヨダカラー輝きGER70/GER81",null,null,null,null,null,"0.80","914",166]
[1527,"D22825030","CG","WTF60 チヨダカラーＮＥＸＴＧ７００",null,null,null,null,null,"0.27","914",207]
[1528,"F20Z18003","CG","WTK90 チヨダカラーＮＥＸＴ　ＧＴ８４０サンドホワイト",null,null,null,null,null,"0.50","914",278]
[1529,"D21Z08086","CG","WTN40 ＪＦＥ　和みＦＩＴ　ＡぞうげいろＮＣ　Ｂ４３Ｗ",null,null,null,null,null,"0.50","914",320]
[1530,"D22Y22001","CG","WTP00 ストロングカラーＶ３　ＧＪＥ３２／９０２ ホワイ",null,null,null,null,null,"0.60","914",1545]
[1416,"A23117014","CS","GLG30 ＧＬＯ－３（グレー）ＣＳ",null,null,null,null,null,"0.80","914",1676]
[1386,"D22513018","FG","BKGL0 ＢＫＯ－５（黒）　ＦＫ２０１８／ＲＡ１４２３",null,null,null,null,null,"0.45","914",2561]
[1387,"D22513019","FG","BKGL0 ＢＫＯ－５（黒）　ＦＫ２０１８／ＲＡ１４２３",null,null,null,null,null,"0.45","914",2373]
[1388,"F20413403","FG","BKGL0 ＢＫＯ－５（黒）　ＦＫ２０１８／ＲＡ１４２３",null,null,null,null,null,"0.50","914",462]
[1391,"D21316030","FG","BKT40 ＪＦＥカラーＦ２０ＧＬ　４１２Ｍチャコールブラック",null,null,null,null,null,"0.50","914",890]
[1397,"D19322400","FG","BLGL0 ＢＬＯ－６（濃紺）ＦＢ１４７１／ＲＡ１４２３",null,null,null,null,null,"0.80","914",465]
[1398,"D21708015","FG","BLHL0 ＢＬＯ－８（ブルー）ＦＢ２０２７／ＲＡ１４２３",null,null,null,null,null,"0.60","914",360]
[1408,"D21Y24011","FG","BWF30 ニスクフロンＳＧＬ　ＦＮ１０２Ｓブラウン",null,null,null,null,null,"0.60","914",180]
[1417,"D20X12002","FG","GLGL0 ＧＬＯ－３（グレー）ＦＡ１４５７／ＲＡ１４２３",null,null,null,null,null,"0.80","914",1872]
[1435,"D22Y07001","FG","GLVX0 ヨドHyperGLカラータフロンYT25Hグレー",null,null,null,null,null,"0.50","914",159]
[1440,"D18201003","FG","GRGL0 ＧＲＯ－２（緑青）ＦＧ１３２１／ＲＡ１４２３",null,null,null,null,null,"0.60","914",846]
[1446,"D21825028","FG","GRSV0 チヨダカラーＨＦ２０　ＧＨ３４２",null,null,null,null,null,"0.40","914",123]
[1447,"D21624022","FG","GRSV0 チヨダカラーＨＦ２０　ＧＨ３４２",null,null,null,null,null,"0.50","914",506]
[1448,"D21Y29039","FG","GRSV0 チヨダカラーＨＦ２０　ＧＨ３４２",null,null,null,null,null,"0.80","914",476]
[1456,"D21526047","FG","GRVC0 ニスクフロンＳＧＬ　ＦＧ１０４Ｓロクショウ",null,null,null,null,null,"0.40","914",1538]
[1457,"D20715006","FG","GRVC0 ニスクフロンＳＧＬ　ＦＧ１０４Ｓロクショウ",null,null,null,null,null,"0.60","914",1077]
[1458,"D21Z15086","FG","GRVC0 ニスクフロンＳＧＬ　ＦＧ１０４Ｓロクショウ",null,null,null,null,null,"0.50","914",454]
[1469,"D23427001","FG","RN810 チヨダカラーＨＦ２０　ＧＨ１５１",null,null,null,null,null,"0.50","914",2119]
[1480,"D20608052","FG","SL2N0 チヨダカラーＨＦ２０　ＧＨ７６９／９０２（Ｍ）",null,null,null,null,null,"0.60","914",675]
[1481,"D20604014","FG","SL2N0 チヨダカラーＨＦ２０　ＧＨ７６９／９０２（Ｍ）",null,null,null,null,null,"0.80","914",1249]
[1482,"F20X14009","FG","SL2N0 チヨダカラーＨＦ２０　ＧＨ７６９／９０２（Ｍ）",null,null,null,null,null,"0.50","914",612]
[1483,"D22427022","FG","SL2Q0 ヨドフロンＹＦ２９スターシルバー（Ｍ）ＹＦ２９Ｙ",null,null,null,null,null,"0.50","914",480]
[1484,"D20120022","FG","SL2Q0 ヨドフロンＹＦ２９スターシルバー（Ｍ）ＹＦ２９Ｙ",null,null,null,null,null,"0.80","914",1455]
[1485,"D20Y27005","FG","SL3G0 チヨダカラーＨＦ２０　ＧＨ８０　（Ｍ）　ＧＨ８０",null,null,null,null,null,"0.60","914",692]
[1486,"D21702001","FG","SL4D0 ヨドフロンＧＬ　ＹＦ８１ライトグレー",null,null,null,null,null,"0.80","914",212]
[1487,"D21X04002","FG","SL4D0 ヨドフロンＧＬ　ＹＦ８１ライトグレー",null,null,null,null,null,"0.80","914",414]
[1493,"D19910001","FG","SL5H0 ニスクフロンＳＧＬ　ＦＭ１０７Ｓ（Ｍ）",null,null,null,null,null,"0.60","914",2405]
[1494,"D21Y26006","FG","SL5H0 ニスクフロンＳＧＬ　ＦＭ１０７Ｓ（Ｍ）",null,null,null,null,null,"0.80","914",801]
[1495,"D23411026","FG","SL5H0 ニスクフロンＳＧＬ　ＦＭ１０７Ｓ（Ｍ）",null,null,null,null,null,"0.40","914",2110]
[1510,"D21819001","FG","SL7Z0 ヨドフロンGL　YF695(M)",null,null,null,null,null,"0.50","914",433]
[1525,"A20720301","FG","TWA70 ニスクフロンＳＧＬ　ＦＧ１０４Ｓ／ＦＧ１０４Ｓ",null,null,null,null,null,"0.50","914",1328]
[1531,"D22511022","FG","WTQ80 ヨドフロンGL YF809/YF1ホワイト",null,null,null,null,null,"0.50","914",1678]
[1395,"A21824001","LS","BKY80 BKO-5 (443CT)",null,null,null,null,null,"0.80","914",653]
[1476,"D22622065","LS","SGA30 SUS445J2（クリアコート塗布）",null,null,null,null,null,"0.60","914",1058]
[1477,"D22622068","LS","SGA30 SUS445J2（クリアコート塗布）",null,null,null,null,null,"0.60","914",1534]
[1470,"D23313001","NG","SG580 ガルバリウム素地（ＪＦＥ）ＡＺ１５０",null,null,null,null,null,"0.50","914",1896]
[1472,"D23306001","NG","SG900 ガルバリウム素地（日鉄鋼板）ＡＺ１５０",null,null,null,null,null,"0.50","914",2598]
[1473,"D23306002","NG","SG900 ガルバリウム素地（日鉄鋼板）ＡＺ１５０",null,null,null,null,null,"0.50","914",1674]
[1474,"D23426008","NG","SG900 ガルバリウム素地（日鉄鋼板）ＡＺ１５０",null,null,null,null,null,"0.50","914",1722]
[1475,"D22510045","NG","SG900 ガルバリウム素地（日鉄鋼板）ＡＺ１５０",null,null,null,null,null,"0.80","914",736]
[1478,"D22427003","NG","SGB60 ガルバリウム素地（淀）",null,null,null,null,null,"0.60","914",453]
[1479,"D22916001","NG","SGE70 エスジーエル素地",null,null,null,null,null,"0.50","914",1824]
[1394,"A22627002","UF","BKX50 ハイレタンＳＧＬ　ＵＺ９３０Ｓ　ブラック",null,null,null,null,null,"0.40","914",737]
[1401,"D21Y29009","UF","BLXY0 スーパーガードＧＬつよしＧＸ４２",null,null,null,null,null,"0.50","914",180]
[1512,"D23421008","UF","SL8G0 ハイレタンSGL UZ532Sシルバーブラウン",null,null,null,null,null,"0.80","914",704]
[1471,"A22414005","ZS","SG710 亜鉛メッキステンレス（タフテンＺ）",null,null,null,null,null,"0.50","914",168]

{"sheet":"Sheet2","index":2,"n_rows":5,"n_cols":14,"rows_kept":5,"cut":false,"hidden":false,"merged":[]}
[]
[null,"工場","00400"]
[]
[null,"ロット","材質","色調名",null,null,"SEQ","数量","備考","板厚","幅","在庫数","実棚数","差異"]
[1471,"A22414005","ZS","SG710 亜鉛メッキステンレス（タフテンＺ）",null,null,null,null,null,"0.50","914",168]

{"sheet":"iE_Setting","index":3,"n_rows":171,"n_cols":2,"rows_kept":171,"cut":false,"hidden":true,"merged":[]}
["http://10.6.1.5/EVOLIOWebService/Service.asmx"]
[0]
[0]
[]
[]
[]
[]
[]
[]
[]
[null,"C000000002"]
[null,"G000000041"]
[null,"レポート_S_棚卸1_対応付け"]
[null,"レポート_S_棚卸1"]
[]
[null,1]
[null,4]
[null,0]
[]
[null,"<?xml version=\"1.0\" encoding=\"utf-16\"?><ReportDefine xmlns:xsd=\"http://www.w3.org/2001/XMLSchema\" xmlns:xsi=\"http://www.w3.org/2001/XMLSchema-instance\"><ReportSheet>Sheet1</ReportSheet><ReportSheetCol>2</ReportSheetCol><ReportStartCell>$11:$11</ReportStartCell><ReportPageRows>0</ReportPageRows><ReportAnotherFile>false</ReportAnotherFile><ReportFileRequest>false</ReportFileRequest><LayoutSheet>Sheet2</LayoutSheet><LayoutSheetCol>4</LayoutSheetCol><LayoutSheetHidden>false</LayoutSheetHidden><ReportHeaderCell /><ReportHeaderFlag>false</ReportHeaderFlag><PageHeaderCell /><DetailCell>$5:$5</DetailCell><DetailCell2>$6:$6</DetailCell2><DetailCount>0</DetailCount><DetailSpaceFlag>false</DetailSpaceFlag><DetailSpaceEven>false</DetailSpaceEven><PageFooterCell /><ReportFooterCell /><ReportFooterFlag>false</ReportFooterFlag><GroupInfo /></ReportDefine>"]
[null,"S_棚卸1"]
[null,"<condition><para name=\"$倉庫$\" sheet=\"Sheet1\" sheetcol=\"2\" cell=\"E4\" /><para name=\"$商品$\" sheet=\"Sheet1\" sheetcol=\"2\" cell=\"E5\" /><para name=\"$材質$\" sheet=\"Sheet1\" sheetcol=\"2\" cell=\"E6\" /><para name=\"$色調$\" sheet=\"Sheet1\" sheetcol=\"2\" cell=\"E7\" /></condition>"]
[]
[]
[]
[]
[]
[]
[]
[]
[]
[]
[]
[]
[]
[]
[]
[]
[]
[]
[]
[]
[]
[]
[]
[]
[]
[]
[]
[]
[]
[]
[]
[]
[]
[]
[]
[]
[]
[]
[]
[]
[]
[]
[]
[]
[]
[]
[]
[]
[]
[]
[]
[]
[]
[]
[]
[]
[]
[]
[]
[]
[]
[]
[]
[]
[]
[]
[]
[null,0]
[]
[null,0]
[]
[]
[]
[]
[]
[]
[]
[]
[]
[null,18]
[null,"ExtractButton_2"]
[null,"抽出"]
[null,"Button"]
[null,48]
[null,327.75]
[null,46.5]
[null,"Placement"]
[null,3]
[]
[]
[null,"<?xml version=\"1.0\" encoding=\"utf-16\"?><ButtonOption xmlns:xsd=\"http://www.w3.org/2001/XMLSchema\" xmlns:xsi=\"http://www.w3.org/2001/XMLSchema-instance\"><MsgBeforeFlag>false</MsgBeforeFlag><MsgBefore /><MsgAfterFlag>false</MsgAfterFlag><MsgAfter /><CurSheetName /><CurSheetCol>0</CurSheetCol></ButtonOption>"]
[]
[]
[]
[]
[]
[]
[]
[]
[]
[]
[]
[]
[]
[]
[]
[]
[]
[]
[]
[null,"<?xml version=\"1.0\" encoding=\"utf-16\"?><ButtonOption xmlns:xsd=\"http://www.w3.org/2001/XMLSchema\" xmlns:xsi=\"http://www.w3.org/2001/XMLSchema-instance\"><MsgBeforeFlag>true</MsgBeforeFlag><MsgBefore /><MsgAfterFlag>true</MsgAfterFlag><MsgAfter /><CurSheetName /><CurSheetCol>0</CurSheetCol></ButtonOption>"]
[]
[]
[]
[]
[]
[]
[]
[]
[]
[]
[null,"検索"]
[]
[]
[]
[]
[]
[]
[]
[]
[]
[]
[]
[]
[]
[]
[]
[]
[]
[]
[]
[]
[]
[]
[]
[]
[]
[]
[null,0]